Target
High affinity nerve growth factor receptor
Ligand
BDBM412262
Substrate
Meas. Tech.
Pharmacological Assay
IC50
<0.1±n/a nM
Citation
 Kawada, Y Intermediate compound of novel tetrahydronaphthyl urea derivative US Patent  US10927079 Publication Date 2/23/2021 
Target
Name:
High affinity nerve growth factor receptor
Synonyms:
2.7.10.1 NTRK1 NTRK1_HUMAN Neurotrophic tyrosine kinase receptor type 1 Synonyms=MTC TRK1-transforming tyrosine kinase protein TRKA GN Trk-A Tropomyosin-related kinase A Tyrosine kinase receptor Tyrosine kinase receptor A Tyrosine kinase receptor A (Trk-A) gp140trk | p140-TrkA
Type:
Mol. Mass.:
87498.18
Organism:
Homo sapiens (Human)
Description:
P04629
Residue:
796
  
Inhibitor
Name:
BDBM412262
Synonyms:
US10399945, Example 1 US10927079, Compound 1
Type:
Small organic molecule
Emp. Form.:
C24H25N3O2
Mol. Mass.:
387.4742
SMILES:
CC1(C)C[C@@H](O)[C@H](NC(=O)Nc2cccnc2-c2ccccc2)c2ccccc12
: