Target
High affinity nerve growth factor receptor
Ligand
BDBM483597
Substrate
Meas. Tech.
Pharmacological Assay
IC50
<0.1±n/a nM
Citation
 Kawada, Y Intermediate compound of novel tetrahydronaphthyl urea derivative US Patent  US10927079 Publication Date 2/23/2021 
Target
Name:
High affinity nerve growth factor receptor
Synonyms:
2.7.10.1 NTRK1 NTRK1_HUMAN Neurotrophic tyrosine kinase receptor type 1 Synonyms=MTC TRK1-transforming tyrosine kinase protein TRKA GN Tropomyosin alpha-3 chain/High affinity nerve growth factor receptor Tropomyosin-related kinase A (TrkA) Tyrosine kinase receptor (Trk) Tyrosine kinase receptor A (Trk A) Tyrosine kinase receptor A (TrkA) p140-TrkA
Type:
Mol. Mass.:
87498.18
Organism:
Homo sapiens (Human)
Description:
P04629
Residue:
796
  
Inhibitor
Name:
BDBM483597
Synonyms:
US10927079, Compound 34b
Type:
Small organic molecule
Emp. Form.:
C30H30FN5O2
Mol. Mass.:
511.5899
SMILES:
Cc1ncc(cn1)-c1nc(c(NC(=O)N[C@H]2[C@@H](O)CC(C)(C)c3ccc(F)cc23)cc1C)-c1ccccc1
: