Target
High affinity nerve growth factor receptor
Ligand
BDBM483591
Substrate
Meas. Tech.
Pharmacological Assay
IC50
0.55±n/a nM
Citation
 Kawada, Y Intermediate compound of novel tetrahydronaphthyl urea derivative US Patent  US10927079 Publication Date 2/23/2021 
Target
Name:
High affinity nerve growth factor receptor
Synonyms:
2.7.10.1 NTRK1 NTRK1_HUMAN Neurotrophic tyrosine kinase receptor type 1 Synonyms=MTC TRK1-transforming tyrosine kinase protein TRKA GN Tropomyosin alpha-3 chain/High affinity nerve growth factor receptor Tropomyosin-related kinase A (TrkA) Tyrosine kinase receptor (Trk) Tyrosine kinase receptor A (Trk A) Tyrosine kinase receptor A (TrkA) p140-TrkA
Type:
Mol. Mass.:
87498.18
Organism:
Homo sapiens (Human)
Description:
P04629
Residue:
796
  
Inhibitor
Name:
BDBM483591
Synonyms:
US10927079, Compound 57
Type:
Small organic molecule
Emp. Form.:
C24H30FN3O3
Mol. Mass.:
427.5117
SMILES:
Cc1cnc(C2CCOCC2)c(NC(=O)N[C@H]2[C@H](O)CC(C)(C)c3ccc(F)cc23)c1
: