Target
Indoleamine 2,3-dioxygenase 1
Ligand
BDBM483536
Substrate
Meas. Tech.
Enzyme Assay
IC50
120±n/a nM
Citation
 Liu, KClausen, DGuo, LHan, YHe, SKozlowski, JLi, DPu, QYu, WZhang, H Substituted sulfoximine compounds as indoleamine 2,3-dioxygenase (IDO) inhibitors US Patent  US10927086 Publication Date 2/23/2021 
Target
Name:
Indoleamine 2,3-dioxygenase 1
Synonyms:
I23O1_HUMAN IDO-1 INDO Indoleamine 2,3-dioxygenase | Indoleamine-pyrrole 2,3-dioxygenase
Type:
Enzyme
Mol. Mass.:
45330.80
Organism:
Homo sapiens (Human)
Description:
P14902
Residue:
403
  
Inhibitor
Name:
BDBM483536
Synonyms:
N—((S)-4-fluorobicyclo[4.2.0]octa-1(6),2,4-trien-7-yl)-N′-hydroxy-4-(((1S,3r)-1-imino-1-oxido-1λ6-thietan-3-yl)amino)-1,2,5-oxadiazole-3-carboximidamide | US10927086, Example 3
Type:
Small organic molecule
Emp. Form.:
C14H15FN6O3S
Mol. Mass.:
366.371
SMILES:
O\N=C(/N[C@H]1Cc2ccc(F)cc12)c1nonc1N[C@H]1C[S@@](=N)(=O)C1
: