Target
Indoleamine 2,3-dioxygenase 1
Ligand
BDBM483565
Substrate
Meas. Tech.
Enzyme Assay
IC50
47.1±n/a nM
Citation
 Liu, KClausen, DGuo, LHan, YHe, SKozlowski, JLi, DPu, QYu, WZhang, H Substituted sulfoximine compounds as indoleamine 2,3-dioxygenase (IDO) inhibitors US Patent  US10927086 Publication Date 2/23/2021 
Target
Name:
Indoleamine 2,3-dioxygenase 1
Synonyms:
I23O1_HUMAN IDO-1 INDO Indoleamine 2,3-dioxygenase | Indoleamine-pyrrole 2,3-dioxygenase
Type:
Enzyme
Mol. Mass.:
45330.80
Organism:
Homo sapiens (Human)
Description:
P14902
Residue:
403
  
Inhibitor
Name:
BDBM483565
Synonyms:
N-[(7S)-4-fluorobicyclo[4.2.0]octa-1,3,5- trien-7-yl]-N''-hydroxy-4-{[4-(S- methylsulfonimidoyl)butyl]amino}-1,2,5- oxadiazole-3-carboximidamide (isomer 1) US10927086, Example 39
Type:
Small organic molecule
Emp. Form.:
C16H21FN6O3S
Mol. Mass.:
396.44
SMILES:
CS(=N)(=O)CCCCNc1nonc1\C(N[C@H]1Cc2ccc(F)cc12)=N\O
: