Target
Monoglyceride lipase
Ligand
BDBM483702
Substrate
Meas. Tech.
In Vitro Competitive Activity-Based Protein Profiling
IC50
<100±n/a nM
Citation
 Grice, CAWiener, JJWeber, ODDuncan, KK Pyrazole MAGL inhibitors US Patent  US10927105 Publication Date 2/23/2021 
Target
Name:
Monoglyceride lipase
Synonyms:
HU-K5 Lysophospholipase-like MGL MGLL_HUMAN
Type:
Hydrolase
Mol. Mass.:
33264.56
Organism:
Homo sapiens (Human)
Description:
Human recombinant MGL (Cayman Chemical, cat# 10008354).
Residue:
303
  
Inhibitor
Name:
BDBM483702
Synonyms:
1-(trans-5-((2- methyl-3- (trifluoromethyl)- benzyl)oxy)- octahydrocyclo- penta-nl [c]pyrrole- 2-carbonyl)-1H- pyrazole-3- carboxylic acid US11655217, Example 159
Type:
Small organic molecule
Emp. Form.:
C21H22F3N3O4
Mol. Mass.:
437.4123
SMILES:
Cc1c(CO[C@@H]2C[C@H]3CN(C[C@H]3C2)C(=O)n2ccc(n2)C(O)=O)cccc1C(F)(F)F
: