Target
Fatty acid 2-hydroxylase
Ligand
BDBM483713
Substrate
Meas. Tech.
In Vitro Competitive Activity-Based Protein Profiling
IC50
<100±n/a nM
Citation
 Grice, CAWiener, JJWeber, ODDuncan, KK Pyrazole MAGL inhibitors US Patent  US10927105 Publication Date 2/23/2021 
Target
Name:
Fatty acid 2-hydroxylase
Synonyms:
FA2H FAAH Fatty acid alpha-hydroxylase | Fatty acid hydroxylase domain-containing protein 1
Type:
Protein
Mol. Mass.:
42806.38
Organism:
Human
Description:
Q7L5A8
Residue:
372
  
Inhibitor
Name:
BDBM483713
Synonyms:
1-(2-(4-(pyrrolidin- 1-yl)-2- (trifluoromethyl)- benzyl)-2,8- diazaspiro[4.5]- decane-8- carbonyl)-1H- pyrazole-3- carboxamide US11655217, Example 195
Type:
Small organic molecule
Emp. Form.:
C25H31F3N6O2
Mol. Mass.:
504.5478
SMILES:
NC(=O)c1ccn(n1)C(=O)N1CCC2(CCN(Cc3ccc(cc3C(F)(F)F)N3CCCC3)C2)CC1
: