Target
Monoglyceride lipase
Ligand
BDBM483872
Substrate
Meas. Tech.
In Vitro Competitive Activity-Based Protein Profiling
IC50
<100±n/a nM
Citation
 Grice, CAWiener, JJWeber, ODDuncan, KK Pyrazole MAGL inhibitors US Patent  US10927105 Publication Date 2/23/2021 
Target
Name:
Monoglyceride lipase
Synonyms:
HU-K5 Lysophospholipase-like MGL MGLL_HUMAN
Type:
Hydrolase
Mol. Mass.:
33264.56
Organism:
Homo sapiens (Human)
Description:
Human recombinant MGL (Cayman Chemical, cat# 10008354).
Residue:
303
  
Inhibitor
Name:
BDBM483872
Synonyms:
N-methyl-1-(5-(3- (trifluoromethyl)- benzyl)- octahydropyrrolo- [3,4-c]pyrrole-2- carbonyl)-1H- pyrazole-3- carboxamide US11655217, Example 432
Type:
Small organic molecule
Emp. Form.:
C20H22F3N5O2
Mol. Mass.:
421.4162
SMILES:
CNC(=O)c1ccn(n1)C(=O)N1CC2CN(Cc3cccc(c3)C(F)(F)F)CC2C1
: