Target
Monoglyceride lipase
Ligand
BDBM483882
Substrate
Meas. Tech.
In Vitro Competitive Activity-Based Protein Profiling
IC50
<100±n/a nM
Citation
 Grice, CAWiener, JJWeber, ODDuncan, KK Pyrazole MAGL inhibitors US Patent  US10927105 Publication Date 2/23/2021 
Target
Name:
Monoglyceride lipase
Synonyms:
HU-K5 Lysophospholipase-like MGL MGLL_HUMAN
Type:
Hydrolase
Mol. Mass.:
33264.56
Organism:
Homo sapiens (Human)
Description:
Human recombinant MGL (Cayman Chemical, cat# 10008354).
Residue:
303
  
Inhibitor
Name:
BDBM483882
Synonyms:
(S)-1-(4-(3-(4- chlorophenoxy)- benzyl)-2- methylpiperazine-1- carbonyl)-4-methyl- 1H-pyrazole-3- carboxylic acid US11655217, Example 442
Type:
Small organic molecule
Emp. Form.:
C24H25ClN4O4
Mol. Mass.:
468.933
SMILES:
C[C@H]1CN(Cc2cccc(Oc3ccc(Cl)cc3)c2)CCN1C(=O)n1cc(C)c(n1)C(O)=O
: