Target
Ubiquitin carboxyl-terminal hydrolase 30
Ligand
BDBM483938
Substrate
Meas. Tech.
Biochemical Assay
IC50
>10000±n/a nM
Citation
 Stockley, MLKemp, MI Cyano-subtituted heterocycles with activity as inhibitors of USP30 US Patent  US10927110 Publication Date 2/23/2021 
Target
Name:
Ubiquitin carboxyl-terminal hydrolase 30
Synonyms:
Deubiquitinating enzyme 30 USP30 Ubiquitin carboxyl-terminal hydrolase 30 (USP30) Ubiquitin-specific-processing protease 30
Type:
Protein
Mol. Mass.:
58522.90
Organism:
Homo sapiens (Human)
Description:
Q70CQ3
Residue:
517
  
Inhibitor
Name:
BDBM483938
Synonyms:
2-(4-(3-Cyanophenyl)-1H-benzo[d]imidazol-2-yl)morpholine-4-carbonitrile | US10927110, Example 5
Type:
Small organic molecule
Emp. Form.:
C19H15N5O
Mol. Mass.:
329.3553
SMILES:
N#CN1CCOC(C1)c1nc2c(cccc2[nH]1)-c1cccc(c1)C#N
: