Target
RAF proto-oncogene serine/threonine-protein kinase
Ligand
BDBM483987
Substrate
Meas. Tech.
Kinase Assay
IC50
<0.1±n/a nM
Citation
 Kaldor, SWKanouni, TArnold, L Inhibitors of RAF kinases US Patent  US10927111 Publication Date 2/23/2021 
Target
Name:
RAF proto-oncogene serine/threonine-protein kinase
Synonyms:
C-Raf Protein Kinase RAF RAF1 Raf-1 Serine/threonine-protein kinase C-Raf | cRaf
Type:
Serine/threonine-protein kinase
Mol. Mass.:
73082.52
Organism:
Homo sapiens (Human)
Description:
P04049
Residue:
648
  
Inhibitor
Name:
BDBM483987
Synonyms:
(R)-2-(tert-butyl)-N-(2-fluoro-4-methyl-5-(7-methyl-2-(methylamino)pyrido[2,3-d]pyrimidin-6-yl)phenyl)morpholine-4-carboxamide and (S)-2-(tert-butyl)-N-(2-fluoro-4-methyl-5-(7-methyl-2-(methylamino)pyrido[2,3-d]pyrimidin-6-yl)phenyl)morpholine-4-carboxamide US11667634, Example 23
Type:
Small organic molecule
Emp. Form.:
C25H31FN6O2
Mol. Mass.:
466.551
SMILES:
CNc1ncc2cc(c(C)nc2n1)-c1cc(NC(=O)N2CCO[C@@H](C2)C(C)(C)C)c(F)cc1C
: