Target
RAF proto-oncogene serine/threonine-protein kinase
Ligand
BDBM484004
Substrate
Meas. Tech.
Kinase Assay
IC50
<0.1±n/a nM
Citation
 Kaldor, SWKanouni, TArnold, L Inhibitors of RAF kinases US Patent  US10927111 Publication Date 2/23/2021 
Target
Name:
RAF proto-oncogene serine/threonine-protein kinase
Synonyms:
C-Raf Protein Kinase RAF RAF1 Raf-1 Serine/threonine-protein kinase C-Raf | cRaf
Type:
Serine/threonine-protein kinase
Mol. Mass.:
73082.52
Organism:
Homo sapiens (Human)
Description:
P04049
Residue:
648
  
Inhibitor
Name:
BDBM484004
Synonyms:
N-(3-(2-((2-hydroxyethyl)amino)-7- methylpyrido[2,3-d]pyrimidin-6-yl)-4- methylphenyl)-2- (trifluoromethyl)isonicotinamide US11667634, Example 40
Type:
Small organic molecule
Emp. Form.:
C24H21F3N6O2
Mol. Mass.:
482.4577
SMILES:
Cc1ccc(NC(=O)c2ccnc(c2)C(F)(F)F)cc1-c1cc2cnc(NCCO)nc2nc1C
: