Target
Replicase polyprotein 1ab
Ligand
BDBM448319
Substrate
Meas. Tech.
immunofluorescence assay of Vero E6 plus 2uM CP-100356
EC50
350±23 nM
Citation
 Xia, ZSacco, MHu, YMa, CMeng, XZhang, FSzeto, TXiang, YChen, YWang, J Rational Design of Hybrid SARS-CoV-2 Main Protease Inhibitors Guided by the Superimposed Cocrystal Structures with the Peptidomimetic Inhibitors GC-376, Telaprevir, and Boceprevir. ACS Pharmacol Transl Sci 4:1408-1421 (2021)  
Target
Name:
Replicase polyprotein 1ab
Synonyms:
ORF1ab polyprotein pp1ab | rep
Type:
Protein
Mol. Mass.:
752739.97
Organism:
HCoV-NL63
Description:
P0C6X5
Residue:
6729
  
Inhibitor
Name:
BDBM448319
Synonyms:
GC-376 | GC376
Type:
Small organic molecule
Emp. Form.:
C21H30N3O8S
Mol. Mass.:
484.544
SMILES:
CC(C)C[C@H](NC(=O)OCc1ccccc1)C(=O)N[C@@H](CC1CCNC1=O)C(O)S([O-])(=O)=O
: