Target
Tyrosine-protein kinase BTK
Ligand
BDBM484306
Substrate
Meas. Tech.
Kinase Assay
IC50
30±n/a nM
Citation
 Liao, XLi, JLu, ZZhou, YGao, A Bruton's tyrosine kinase inhibitors US Patent  US10933063 Publication Date 3/2/2021 
Target
Name:
Tyrosine-protein kinase BTK
Synonyms:
AGMX1 Agammaglobulinaemia tyrosine kinase B cell progenitor kinase BPK BTK_HUMAN Tyrosine Kinase BTK Tyrosine-protein kinase BTK (BTK)
Type:
Enzyme
Mol. Mass.:
76289.95
Organism:
Homo sapiens (Human)
Description:
Q06187
Residue:
659
  
Inhibitor
Name:
BDBM484306
Synonyms:
(R,E)-4-(cyclopropyl(methyl)amino)- 1-(3-(1-(4-(2-fluoro-3- methoxyphenoxy)phenyl)-8- methylimidazo[1,5-a]pyrazin-3- yl)pyrrolidin-1-yl)but-2-en-1-one US11554118, Compound 105
Type:
Small organic molecule
Emp. Form.:
C32H34FN5O3
Mol. Mass.:
555.6425
SMILES:
COc1cccc(Oc2ccc(cc2)-c2nc([C@@H]3CCN(C3)C(=O)\C=C\CN(C)C3CC3)n3ccnc(C)c23)c1F
: