Target
SH2B adapter protein 2
Ligand
BDBM484469
Substrate
Meas. Tech.
Inhibition Assay
IC50
2.80±n/a nM
Citation
 Chen, ZFortanet, JGKarki, RLamarche, MJMajumdar, DPerez, LBSendzik, MSmith, TDYang, FYu, B Compounds and compositions for inhibiting the activity of SHP2 US Patent  US10934285 Publication Date 3/2/2021 
Target
Name:
SH2B adapter protein 2
Synonyms:
APS SH2 and PH domain-containing adapter protein APS SH2B2_HUMAN
Type:
Protein
Mol. Mass.:
67733.52
Organism:
Human
Description:
O14492
Residue:
632
  
Inhibitor
Name:
BDBM484469
Synonyms:
US10934285, Example 55
Type:
Small organic molecule
Emp. Form.:
C24H30ClN7O3S
Mol. Mass.:
532.058
SMILES:
CCC1N(C)C(=O)C(C(=O)Nc2cccc(Sc3ncc(nc3N)N3CCC(C)(N)CC3)c2Cl)=C1O
: