Target
SH2B adapter protein 2
Ligand
BDBM484471
Substrate
Meas. Tech.
Inhibition Assay
IC50
11.0±n/a nM
Citation
 Chen, ZFortanet, JGKarki, RLamarche, MJMajumdar, DPerez, LBSendzik, MSmith, TDYang, FYu, B Compounds and compositions for inhibiting the activity of SHP2 US Patent  US10934285 Publication Date 3/2/2021 
Target
Name:
SH2B adapter protein 2
Synonyms:
APS SH2 and PH domain-containing adapter protein APS SH2B2_HUMAN
Type:
Protein
Mol. Mass.:
67733.52
Organism:
Human
Description:
O14492
Residue:
632
  
Inhibitor
Name:
BDBM484471
Synonyms:
US10934285, Example 57
Type:
Small organic molecule
Emp. Form.:
C27H28ClN7O3S
Mol. Mass.:
566.074
SMILES:
C[C@H]1CN(C[C@@H](C)N1)c1cnc(Sc2cccc(NC(=O)C3=C(O)CN(C3=O)c3ccccc3)c2Cl)c(N)n1
: