Target
Mitogen-activated protein kinase kinase kinase kinase 1
Ligand
BDBM414702
Substrate
Meas. Tech.
Kinase Binding Assay
Ki
<100±n/a nM
Citation
 Vechorkin, OLiu, KSokolsky, AWang, AYe, HFYe, QYao, W Pyrazolopyridine compounds and uses thereof US Patent  US10934288 Publication Date 3/2/2021 
Target
Name:
Mitogen-activated protein kinase kinase kinase kinase 1
Synonyms:
HPK1 MAP4K1
Type:
PROTEIN
Mol. Mass.:
91316.07
Organism:
Homo sapiens (Human)
Description:
ChEMBL_586597
Residue:
833
  
Inhibitor
Name:
BDBM414702
Synonyms:
US10435405, Example 119 | US10934288, Example 119
Type:
Small organic molecule
Emp. Form.:
C25H25F4N7
Mol. Mass.:
499.5065
SMILES:
CNCc1cc(F)c(-c2cc3c(n[nH]c3cn2)-c2ccc(nc2)N2CCN(C)CC2)c(c1)C(F)(F)F
: