Target
Isoform PDE9A2 of High affinity cGMP-specific 3',5'-cyclic phosphodiesterase 9A (PDE9A2)
Ligand
BDBM484529
Substrate
Meas. Tech.
Fluorescence Polarization Assay
Ki
0.010±n/a nM
Citation
 Arasappan, ACox, JMDebenham, JSGuo, ZHe, JHussain, ZLai, ZLi, DMeng, DRaghavan, STyagarajan, S Substituted pyrazolo[3,4-d]pyrimidines as PDE9 inhibitors US Patent  US10934294 Publication Date 3/2/2021 
Target
Name:
Isoform PDE9A2 of High affinity cGMP-specific 3',5'-cyclic phosphodiesterase 9A (PDE9A2)
Synonyms:
High affinity cGMP-specific 3',5'-cyclic phosphodiesterase 9A (PDE9A2) PDE9A_HUMAN Phosphodiesterase 9A2
Type:
Protein
Mol. Mass.:
61702.98
Organism:
Homo sapiens (Human)
Description:
O76083-2
Residue:
533
  
Inhibitor
Name:
BDBM484529
Synonyms:
US10934294, Example 50 US10934294, Example 52 US10934294, Example 54 US10934294, Example 56 US11028092, Example 57
Type:
Small organic molecule
Emp. Form.:
C24H22N8O
Mol. Mass.:
438.4845
SMILES:
CC(c1ccc(nc1)C1CC1)n1nc(C#N)c2c1nc([nH]c2=O)C1CCC1c1ncccn1
: