Target
Programmed cell death 1 ligand/protein 1
Ligand
BDBM485684
Substrate
Meas. Tech.
In Vitro Activity Assay
IC50
38.5±n/a nM
Citation
 Feng, ZChen, XYang, YLai, FJi, MZhang, LZheng, YXue, NWang, KLi, L Benzyl phenyl ether derivative, preparation method therefor, and pharmaceutical composition and uses thereof US Patent  US10941129 Publication Date 3/9/2021 
Target
Name:
Programmed cell death 1 ligand/protein 1
Synonyms:
PD-1/PD-L1 | Programmed cell death protein 1/Programmed cell death 1 ligand 1
Type:
Protein
Mol. Mass.:
Description:
Components:
This complex has 2 components.
Component 1
Name:
Programmed cell death protein 1
Synonyms:
CD_antigen=CD279 PDCD1 Programmed cell death protein 1 hPD-1
Type:
PROTEIN
Mol. Mass.:
31650.07
Organism:
Homo sapiens
Description:
ChEMBL_108437
Residue:
288
  
Component 2
Name:
Programmed cell death 1 ligand 1
Synonyms:
B7 homolog 1 B7H1 CD274 PD-L1 PDCD1 ligand 1 PDCD1LG1 Programmed cell death 1 ligand 1 | Programmed death ligand 1
Type:
PROTEIN
Mol. Mass.:
33278.49
Organism:
Homo sapiens (Human)
Description:
ChEMBL_109807
Residue:
290
  
Inhibitor
Name:
BDBM485684
Synonyms:
N-(4-(2-bromo-3-(2,3-dihydrobenzo[b][1,4]dioxin-6-yl)benzyloxy)-2-(3-cyanobenzyl oxy) benzyl) serine | US10941129, Example 18
Type:
Small organic molecule
Emp. Form.:
C33H29BrN2O7
Mol. Mass.:
645.497
SMILES:
OC[C@H](NCc1ccc(OCc2cccc(c2Br)-c2ccc3OCCOc3c2)cc1OCc1cccc(c1)C#N)C(O)=O
: