Target
Genome polyprotein
Ligand
BDBM486192
Substrate
Meas. Tech.
RNA-Dependent RNA HCV NS5B (polymerase) Assay and IC50 Determination
IC50
>1000±n/a nM
Citation
 Jacobson, ICFeese, MDLee, SS Inhibitors of Hepatitis C virus polymerase US Patent  US10947210 Publication Date 3/16/2021 
Target
Name:
Genome polyprotein
Synonyms:
HCV 3a POLG_HCVK3
Type:
Enzyme Catalytic Domain
Mol. Mass.:
328455.91
Organism:
Hepatitis C virus genotype 3a (isolate k3a) (HCV)
Description:
Q81495
Residue:
3021
  
Inhibitor
Name:
BDBM486192
Synonyms:
US10947210, Compound 11-5B
Type:
Small organic molecule
Emp. Form.:
C35H39FN2O8S
Mol. Mass.:
666.756
SMILES:
CCOC(=O)c1cccc(CCOCCOCCN(c2cc3oc(c(C(=O)NC)c3cc2C2CC2)-c2ccc(F)cc2)S(C)(=O)=O)c1
: