Target
Diacylglycerol O-acyltransferase 2
Ligand
BDBM486365
Substrate
Meas. Tech.
DGAT2 Enzymatic Activity Assay
IC50
671±n/a nM
Citation
 Shen, DGraham, THJiang, JDing, FTudge, C Indole derivatives useful as inhibitors of diacylglyceride O-acyltransferase 2 US Patent  US10947222 Publication Date 3/16/2021 
Target
Name:
Diacylglycerol O-acyltransferase 2
Synonyms:
ARAT DGAT2 Diacylglycerol O-acyltransferase 2 (DGAT2) Retinol O-fatty-acyltransferase
Type:
Multi-pass membrane protein
Mol. Mass.:
43848.90
Organism:
Homo sapiens (Human)
Description:
Q96PD7
Residue:
388
  
Inhibitor
Name:
BDBM486365
Synonyms:
(R)-3-(2-chlorophenyl)-1-(4- fluorophenyl)-N-(1-(6- (trifluoromethyl)pyridin-3-yl)ethyl)- 1H-indole-6-carboxamide | US10947222, Example 7
Type:
Small organic molecule
Emp. Form.:
C29H20ClF4N3O
Mol. Mass.:
537.935
SMILES:
C[C@@H](NC(=O)c1ccc2c(cn(-c3ccc(F)cc3)c2c1)-c1ccccc1Cl)c1ccc(nc1)C(F)(F)F
: