Target
Diacylglycerol O-acyltransferase 2
Ligand
BDBM486378
Substrate
Meas. Tech.
DGAT2 Enzymatic Activity Assay
IC50
16.0±n/a nM
Citation
 Shen, DGraham, THJiang, JDing, FTudge, C Indole derivatives useful as inhibitors of diacylglyceride O-acyltransferase 2 US Patent  US10947222 Publication Date 3/16/2021 
Target
Name:
Diacylglycerol O-acyltransferase 2
Synonyms:
ARAT DGAT2 Diacylglycerol O-acyltransferase 2 (DGAT2) Retinol O-fatty-acyltransferase
Type:
Multi-pass membrane protein
Mol. Mass.:
43848.90
Organism:
Homo sapiens (Human)
Description:
Q96PD7
Residue:
388
  
Inhibitor
Name:
BDBM486378
Synonyms:
3-(2-chlorophenyl)-1-(5-fluoropyridin- 2-yl)-N-(3-methyl-1,1- dioxidotetrahydrothiophen-3-yl)-1H- indole-6-carboxamide (Enantiomer A, Fast) | US10947222, Example 14-A
Type:
Small organic molecule
Emp. Form.:
C25H21ClFN3O3S
Mol. Mass.:
497.969
SMILES:
C[C@]1(CCS(=O)(=O)C1)NC(=O)c1ccc2c(cn(-c3ccc(F)cn3)c2c1)-c1ccccc1Cl
: