Target
Tyrosine-protein kinase JAK1
Ligand
BDBM473568
Substrate
Meas. Tech.
Biochemical JAK Kinase Assays
Ki
0.100±n/a nM
Citation
 Long, DDSmith, CThompson, C Dimethyl amino azetidine amides as JAK inhibitors US Patent  US10947229 Publication Date 3/16/2021 
Target
Name:
Tyrosine-protein kinase JAK1
Synonyms:
JAK-1 JAK1A JAK1_HUMAN Janus kinase 1 (JAK1) | Janus kinase 1 JAK1
Type:
Protein
Mol. Mass.:
133293.73
Organism:
Homo sapiens (Human)
Description:
P23458
Residue:
1154
  
Inhibitor
Name:
BDBM473568
Synonyms:
US10844057, Example 11 US11634419, Example 4
Type:
Small organic molecule
Emp. Form.:
C31H39N7O2
Mol. Mass.:
541.6871
SMILES:
CCc1cc(O)ccc1-c1ccc2c(n[nH]c2c1)-c1nc2C[C@H](N(Cc2[nH]1)C(C)C)C(=O)N1CC(C)(C1)N(C)C
: