Target
Fibroblast growth factor receptor 1
Ligand
BDBM278488
Substrate
Meas. Tech.
FGFR Enzymatic Assay
IC50
<100±n/a nM
Citation
 Sun, YYao, WWu, LXu, MQian, DZhang, F Bicyclic heterocycles as FGFR inhibitors US Patent  US10947230 Publication Date 3/16/2021 
Target
Name:
Fibroblast growth factor receptor 1
Synonyms:
BFGFR Basic fibroblast growth factor receptor 1 (FGFR1) CEK FGFR-1 FGFR-1, (FL) FGFR1_HUMAN FLT2 Fibroblast growth factor receptor 1 (FGFR-1) Fms-like tyrosine kinase 2 N-sam bFGF-R | c-fgr
Type:
Receptor
Mol. Mass.:
91861.70
Organism:
Homo sapiens (Human)
Description:
P11362
Residue:
822
  
Inhibitor
Name:
BDBM278488
Synonyms:
7-amino-3-(2,6-difluoro-3,5-dimethoxyphenyl)-8-ethoxy-1-methyl-3,4-dihydropyrido[4,3-d]pyrimidin-2(1H)-one US10450313, Example 4 US11530214, Example 4
Type:
Small organic molecule
Emp. Form.:
C18H20F2N4O4
Mol. Mass.:
394.3726
SMILES:
CCOc1c(N)ncc2CN(C(=O)N(C)c12)c1c(F)c(OC)cc(OC)c1F
: