Target
Fibroblast growth factor receptor 3
Ligand
BDBM278490
Substrate
Meas. Tech.
FGFR Enzymatic Assay
IC50
<100±n/a nM
Citation
 Sun, YYao, WWu, LXu, MQian, DZhang, F Bicyclic heterocycles as FGFR inhibitors US Patent  US10947230 Publication Date 3/16/2021 
Target
Name:
Fibroblast growth factor receptor 3
Synonyms:
CD_antigen: CD333 FGFR3 Fibroblast growth factor receptor JTK4
Type:
Protein
Mol. Mass.:
87699.57
Organism:
Homo sapiens (Human)
Description:
P22607
Residue:
806
  
Inhibitor
Name:
BDBM278490
Synonyms:
7-amino-3-(2,6-difluoro-3,5-dimethoxyphenyl)-1-methyl-8-[2-(4-methylpiperazin-1-yl)ethoxy]-3,4-dihydropyrido[4,3-d]pyrimidin-2(1H)-one US10450313, Example 6 US11530214, Example 6
Type:
Small organic molecule
Emp. Form.:
C23H30F2N6O4
Mol. Mass.:
492.5189
SMILES:
COc1cc(OC)c(F)c(N2Cc3cnc(N)c(OCCN4CCN(C)CC4)c3N(C)C2=O)c1F
: