Target
Sodium channel protein type 9 subunit alpha
Ligand
BDBM486556
Substrate
Meas. Tech.
Electrophysiological Assay (EP) (In Vitro Assay)
IC50
2.21±n/a nM
Citation
 McKerrall, SSafina, BSKolesnikov, AZhang, BLiu, WLai, KW Therapeutic compounds and methods of use thereof US Patent  US10947251 Publication Date 3/16/2021 
Target
Name:
Sodium channel protein type 9 subunit alpha
Synonyms:
NENA Peripheral sodium channel 1 SCN9A_HUMAN Voltage-gated sodium channel subunit Nav1.7 hNE-Na
Type:
Protein
Mol. Mass.:
226375.97
Organism:
Homo sapiens (Human)
Description:
Q15858
Residue:
1988
  
Inhibitor
Name:
BDBM486556
Synonyms:
30 | US10947251, Example 29
Type:
Small organic molecule
Emp. Form.:
C24H22F4N4O7S
Mol. Mass.:
586.513
SMILES:
[H][C@@]12CN(CC[C@@]1([H])N(C(=O)CO2)c1cc(F)c(cc1OC)-c1cccc(OC(F)(F)F)c1)S(=O)(=O)Nc1ccon1
: