Target
Kelch-like ECH-associated protein 1/Nuclear factor erythroid 2-related factor 2
Ligand
BDBM486663
Substrate
Meas. Tech.
ThermoFluor (Tf) assay
Kd
<1.000±n/a nM
Citation
 Barbay, JKChai, WHirst, GCKreutter, KDKummer, DAMcClure, KJNishimura, RTShih, AYVenable, JDVenkatesan, HWei, J Inhibitors of KEAP1-Nrf2 protein-protein interaction US Patent  US10947252 Publication Date 3/16/2021 
Target
Name:
Kelch-like ECH-associated protein 1/Nuclear factor erythroid 2-related factor 2
Synonyms:
Nrf2-Keap1 protein
Type:
Protein
Mol. Mass.:
Description:
Components:
This complex has 2 components.
Component 1
Name:
Nuclear factor erythroid 2-related factor 2
Synonyms:
HEBP1 NF-E2-related factor 2 NFE2-related factor 2 NRF2 Nuclear factor, erythroid derived 2, like 2
Type:
PROTEIN
Mol. Mass.:
67786.89
Organism:
Homo sapiens (Human)
Description:
ChEMBL_107924
Residue:
605
  
Component 2
Name:
Kelch-like ECH-associated protein 1
Synonyms:
Cytosolic inhibitor of Nrf2 KEAP1 KEAP1_HUMAN KLHL19 | Kelch-like protein 19
Type:
PROTEIN
Mol. Mass.:
69664.53
Organism:
Homo sapiens (Human)
Description:
ChEMBL_107924
Residue:
624
  
Inhibitor
Name:
BDBM486663
Synonyms:
US10947252, Example 99
Type:
Small organic molecule
Emp. Form.:
C29H26F4N4O6S
Mol. Mass.:
634.599
SMILES:
Cc1ccc(cc1CN1CC2(COC2)Oc2ccc(F)cc2S1(=O)=O)[C@H](CC(O)=O)c1ccn2c(nnc2c1C)C(F)(F)F
: