Target
Sigma non-opioid intracellular receptor 1
Ligand
BDBM50370625
Substrate
Meas. Tech.
TBD
Ki
245±n/a nM
Citation
 Martin, SFSahn, JJLinkens, KT Sigma receptor binders US Patent  US10954217 Publication Date 3/23/2021 
Target
Name:
Sigma non-opioid intracellular receptor 1
Synonyms:
Aging-associated gene 8 protein SGMR1_HUMAN SIGMAR1 SR31747-binding protein Sigma 1-type opioid receptor Sigma1R | hSigmaR1
Type:
Enzyme Catalytic Domain
Mol. Mass.:
25124.85
Organism:
Homo sapiens (Human)
Description:
Q99720
Residue:
223
  
Inhibitor
Name:
BDBM50370625
Synonyms:
CHEMBL4173095 | US10954217, Example 00241
Type:
Small organic molecule
Emp. Form.:
C25H31N3O2
Mol. Mass.:
405.5325
SMILES:
CC(=C)CN1CCN(CC1)c1ccc2CCN(Cc2c1)C(=O)OCc1ccccc1
: