Target
Glutamate receptor ionotropic, NMDA 2B
Ligand
BDBM423267
Substrate
Meas. Tech.
Radioligand Binding Assay
Ki
4.08±n/a nM
Citation
 Islam, IThangathirupathy, SWarrier, JSCheruku, SShetty, PMacor, JE Selective NR2B antagonists US Patent  US10954225 Publication Date 3/23/2021 
Target
Name:
Glutamate receptor ionotropic, NMDA 2B
Synonyms:
GluN2B Grin2b NMDA receptor subunit N2B (GluN2B) NMDE2_RAT | NR2B
Type:
Protein
Mol. Mass.:
166077.66
Organism:
Rattus norvegicus (Rat)
Description:
Q00960
Residue:
1482
  
Inhibitor
Name:
BDBM423267
Synonyms:
US10501451, Example 1, P-1 US10954225, Example 1,P-2
Type:
Small organic molecule
Emp. Form.:
C21H23FN2O3
Mol. Mass.:
370.4173
SMILES:
Oc1ccc(cc1)C1CCN(CC1)C1CON(Cc2ccc(F)cc2)C1=O
: