Target
Proto-oncogene tyrosine-protein kinase receptor Ret [V804M]
Ligand
BDBM488365
Substrate
Meas. Tech.
Enzyme Assay
IC50
16.5±n/a nM
Citation
 Jordan, AMNewton, RWaszkowycz, BSutton, JMHynd, GPaoletta, SFordyce, EA Heterocyclic compounds as ret kinase inhibitors US Patent  US10954241 Publication Date 3/23/2021 
Target
Name:
Proto-oncogene tyrosine-protein kinase receptor Ret [V804M]
Synonyms:
CDHF12 PTC RET RET51 ret enzyme (v804m)
Type:
Enzyme Catalytic Domain
Mol. Mass.:
124350.36
Organism:
Homo sapiens (Human)
Description:
P07949[V804M]
Residue:
1114
  
Inhibitor
Name:
BDBM488365
Synonyms:
2-(4-Amino-1-isopropyl-pyrazolo[3,4-d]pyrimidin- 3-yl)-3-chloro-N-methyl-1H-indole-6- carboxamide US11548896, Example 5
Type:
Small organic molecule
Emp. Form.:
C18H18ClN7O
Mol. Mass.:
383.835
SMILES:
CNC(=O)c1ccc2c(Cl)c([nH]c2c1)-c1nn(C(C)C)c2ncnc(N)c12
: