Target
Proto-oncogene tyrosine-protein kinase receptor Ret
Ligand
BDBM488395
Substrate
Meas. Tech.
Enzyme Assay
IC50
17.1±n/a nM
Citation
 Jordan, AMNewton, RWaszkowycz, BSutton, JMHynd, GPaoletta, SFordyce, EA Heterocyclic compounds as ret kinase inhibitors US Patent  US10954241 Publication Date 3/23/2021 
Target
Name:
Proto-oncogene tyrosine-protein kinase receptor Ret
Synonyms:
CDHF12 Cadherin family member 12 Proto-oncogene c-Ret RET51 Tyrosine-protein kinase Ret (RET)
Type:
Protein
Mol. Mass.:
124318.29
Organism:
Homo sapiens (Human)
Description:
P07949
Residue:
1114
  
Inhibitor
Name:
BDBM488395
Synonyms:
2-(4-Amino-1-tert-butyl-pyrazolo[3,4-d]pyrimidin- 3-yl)-3-chloro-N-[1-(2-methoxyethyl)pyrazol-3-yl]- 1H-indole-6-carboxamide US11548896, Example 35
Type:
Small organic molecule
Emp. Form.:
C24H26ClN9O2
Mol. Mass.:
507.975
SMILES:
COCCn1ccc(NC(=O)c2ccc3c(Cl)c([nH]c3c2)-c2nn(c3ncnc(N)c23)C(C)(C)C)n1
: