Target
Proto-oncogene tyrosine-protein kinase receptor Ret [V804M]
Ligand
BDBM488400
Substrate
Meas. Tech.
Enzyme Assay
IC50
5.55±n/a nM
Citation
 Jordan, AMNewton, RWaszkowycz, BSutton, JMHynd, GPaoletta, SFordyce, EA Heterocyclic compounds as ret kinase inhibitors US Patent  US10954241 Publication Date 3/23/2021 
Target
Name:
Proto-oncogene tyrosine-protein kinase receptor Ret [V804M]
Synonyms:
CDHF12 PTC RET RET51 ret enzyme (v804m)
Type:
Enzyme Catalytic Domain
Mol. Mass.:
124350.36
Organism:
Homo sapiens (Human)
Description:
P07949[V804M]
Residue:
1114
  
Inhibitor
Name:
BDBM488400
Synonyms:
2-(4-Amino-1-tert-butyl-pyrazolo[3,4-d]pyrimidin- 3-yl)-3-chloro-N-[1-[2- (dimethylamino)ethyl]pyrazol-3-yl]-1H-indole-6- carboxamide US11548896, Example 40
Type:
Small organic molecule
Emp. Form.:
C25H29ClN10O
Mol. Mass.:
521.017
SMILES:
CN(C)CCn1ccc(NC(=O)c2ccc3c(Cl)c([nH]c3c2)-c2nn(c3ncnc(N)c23)C(C)(C)C)n1
: