Target
Proto-oncogene tyrosine-protein kinase receptor Ret
Ligand
BDBM488446
Substrate
Meas. Tech.
Enzyme Assay
IC50
5.23±n/a nM
Citation
 Jordan, AMNewton, RWaszkowycz, BSutton, JMHynd, GPaoletta, SFordyce, EA Heterocyclic compounds as ret kinase inhibitors US Patent  US10954241 Publication Date 3/23/2021 
Target
Name:
Proto-oncogene tyrosine-protein kinase receptor Ret
Synonyms:
CDHF12 Cadherin family member 12 Proto-oncogene c-Ret RET51 Tyrosine-protein kinase Ret (RET)
Type:
Protein
Mol. Mass.:
124318.29
Organism:
Homo sapiens (Human)
Description:
P07949
Residue:
1114
  
Inhibitor
Name:
BDBM488446
Synonyms:
2-{4-Amino-1-cyclopentyl-1H-pyrazolo[3,4- d]pyrimidin-3-yl}-3-chloro-N-methyl-1H-indole-6- carboxamide US11548896, Example 86
Type:
Small organic molecule
Emp. Form.:
C20H20ClN7O
Mol. Mass.:
409.872
SMILES:
CNC(=O)c1ccc2c(Cl)c([nH]c2c1)-c1nn(C2CCCC2)c2ncnc(N)c12
: