Target
Wee1-like protein kinase
Ligand
BDBM488541
Substrate
Meas. Tech.
In Vitro Enzymatic Inhibitory Activity Assay
IC50
6.30±n/a nM
Citation
 Qian, WYang, CLi, ZLi, JLi, JChen, S 1,2-dihydro-3H-pyrazolo[3,4-d]pyrimidin-3-one derivative as Wee1 inhibitor US Patent  US10954253 Publication Date 3/23/2021 
Target
Name:
Wee1-like protein kinase
Synonyms:
Serine/threonine-protein kinase WEE1 WEE1 homolog (S. pombe) | WEE1_HUMAN
Type:
PROTEIN
Mol. Mass.:
71599.12
Organism:
Homo sapiens (Human)
Description:
ChEMBL_1445054
Residue:
646
  
Inhibitor
Name:
BDBM488541
Synonyms:
US10954253, Compound 48
Type:
Small organic molecule
Emp. Form.:
C32H40N8O2
Mol. Mass.:
568.7124
SMILES:
CC(C)Oc1cccc(n1)-n1n(CC=C)c(=O)c2cnc(Nc3ccc(cc3)N3CCC4(CCN(C)CC4)CC3)nc12
: