BDBM12547 6-chloro-N-[(3S)-1-[(2S)-1-(morpholin-4-yl)-1-oxopropan-2-yl]-2-oxopyrrolidin-3-yl]-1-benzothiophene-2-sulfonamide::Arylsulfonamide 1a::N-[(3S)-2-oxopyrrolidin-3-yl]sulfonamide, 1e
SMILES C[C@H](N1CC[C@H](NS(=O)(=O)c2cc3ccc(Cl)cc3s2)C1=O)C(=O)N1CCOCC1
InChI Key InChIKey=PHLKBODTBJLXRD-WFASDCNBSA-N
Data  2 KI
PDB links: 1 PDB ID matches this monomer.
  Tab Delimited (TSV)   2D SDfile   Computed 3D by Vconf -m prep SDfile
Find this compound or compounds like it in BindingDB:
Activity Spreadsheet -- Enzyme Inhibition Constant Data from BindingDB
Found 2 hits for monomerid = 12547
TargetCoagulation factor X(Homo sapiens (Human))
Gsk
LigandPNGBDBM12547(6-chloro-N-[(3S)-1-[(2S)-1-(morpholin-4-yl)-1-oxop...)
Affinity DataKi:  15nM ΔG°:  -10.6kcal/molepH: 7.4 T: 2°C. Assay description: The ability of test compounds to inhibit human fXa in vitro was determined in a fluorescence assay using rhodamime 110, bis-(Boc-L-glycylglycyl-L-arg...
TargetCoagulation factor X(Homo sapiens (Human))
Gsk
LigandPNGBDBM12547(6-chloro-N-[(3S)-1-[(2S)-1-(morpholin-4-yl)-1-oxop...)
Affinity DataKi:  15nM ΔG°:  -10.7kcal/molepH: 7.8 T: 2°C. Assay description: The inhibitory effect of test compound for human fXa was determined by using the chromogenic substrate. The hydrolysis rates of chromogenic substrate...