BDBM135806 US8853227, TK- 000009::USRE48253, Designation TK-000009
SMILES COCc1cn2[C@@H]3O[C@H](CO)[C@@H](O)[C@@H]3Oc2nc1=O
InChI Key InChIKey=WSIVUJPDBLOOCP-BDNRQGISSA-N
Data  2 IC50
  Tab Delimited (TSV)   2D SDfile   Computed 3D by Vconf -m prep SDfile
Find this compound or compounds like it in BindingDB:
Activity Spreadsheet -- Enzyme Inhibition Constant Data from BindingDB
Found 2 hits for monomerid = 135806
TargetUridine phosphorylase 1(Homo sapiens (Human))
Tosk
US Patent
LigandPNGBDBM135806(US8853227, TK- 000009 | USRE48253, Designation TK-...)
Affinity DataIC50: <1.00E+5nM. Assay description: The aim of this study was to evaluate TK-112690 in vivo as an inhibitor of uridine phosphorylase (UPase) enzyme activity. The range of TK-112690 dose...
In DepthDetails US Patent
TargetUridine phosphorylase 1(Homo sapiens (Human))
Tosk
US Patent
LigandPNGBDBM135806(US8853227, TK- 000009 | USRE48253, Designation TK-...)
Affinity DataIC50: <1.00E+5nMpH: 7.3 T: 2°C. Assay description: The aim of this study was to evaluate TK-112690 in vivo as an inhibitor of uridine phosphorylase (UPase) enzyme activity. The range of TK-112690 dose...
In DepthDetails US Patent