BDBM14868 3-{[3-(2-hydroxy-3-{1H-pyrrolo[3,2-c]pyridin-2-yl}phenyl)phenyl]methyl}-1-phenylurea::5-azaindole analog 6
SMILES Oc1c(cccc1-c1cccc(CNC(=O)Nc2ccccc2)c1)-c1cc2cnccc2[nH]1
InChI Key InChIKey=MYWMHTLQFNYXPC-UHFFFAOYSA-N
Data  1 KI
PDB links: 1 PDB ID matches this monomer.
  Tab Delimited (TSV)   2D SDfile   Computed 3D by Vconf -m prep SDfile
Find this compound or compounds like it in BindingDB:
Activity Spreadsheet -- Enzyme Inhibition Constant Data from BindingDB
Found 1 hit for monomerid = 14868
TargetCoagulation factor VII(Homo sapiens (Human))
Celera
LigandPNGBDBM14868(3-{[3-(2-hydroxy-3-{1H-pyrrolo[3,2-c]pyridin-2-yl}...)
Affinity DataKi:  61.5nM ΔG°:  -9.73kcal/molepH: 7.4 T: 2°C. Assay description: The enzyme reactions were initiated by the addition of substrate, and the color developed from the release of p-nitroanilide from each chromogenic su...