BDBM15338 5,7-dihydroxy-2-(4-methoxyphenyl)-8-(3-methylbutyl)-3-[(2S,3R,4R,5R,6S)-3,4,5-trihydroxy-6-methyl-oxan-2-yl]oxy-chromen-4-one::5,7-dihydroxy-2-(4-methoxyphenyl)-8-(3-methylbutyl)-3-{[(2S,3R,4R,5R,6S)-3,4,5-trihydroxy-6-methyloxan-2-yl]oxy}-4H-chromen-4-one::7CA::Icarisid II
SMILES COc1ccc(cc1)-c1oc2c(CCC(C)C)c(O)cc(O)c2c(=O)c1O[C@@H]1O[C@@H](C)[C@H](O)[C@@H](O)[C@H]1O
InChI Key InChIKey=PFVZUXQCELCLBL-LVKFHIPRSA-N
Data  3 IC50
PDB links: 1 PDB ID matches this monomer.
  Tab Delimited (TSV)   2D SDfile   Computed 3D by Vconf -m prep SDfile
Find this compound or compounds like it in BindingDB:
Activity Spreadsheet -- Enzyme Inhibition Constant Data from BindingDB
Found 3 hits for monomerid = 15338
TargetcGMP-specific 3',5'-cyclic phosphodiesterase [535-860](Homo sapiens (Human))
University Of North Carolina At Chapel Hill
LigandPNGBDBM15338(5,7-dihydroxy-2-(4-methoxyphenyl)-8-(3-methylbutyl...)
Affinity DataIC50:  1.70E+3nMpH: 7.8 T: 2°C. Assay description: Enzymatic activity of the isolated catalytic domains of wild type PDE5A1 and its deletion mutants was assayed by using [3H]cGMP as substrate in a rea...
TargetcGMP-specific 3',5'-cyclic phosphodiesterase [1-660,682-875](Homo sapiens (Human))
University Of North Carolina At Chapel Hill
LigandPNGBDBM15338(5,7-dihydroxy-2-(4-methoxyphenyl)-8-(3-methylbutyl...)
Affinity DataIC50:  5.50E+4nMpH: 7.8 T: 2°C. Assay description: Enzymatic activity of the isolated catalytic domains of wild type PDE5A1 and its deletion mutants was assayed by using [3H]cGMP as substrate in a rea...
TargetcGMP-specific 3',5'-cyclic phosphodiesterase [1-662,679-875](Homo sapiens (Human))
University Of North Carolina At Chapel Hill
LigandPNGBDBM15338(5,7-dihydroxy-2-(4-methoxyphenyl)-8-(3-methylbutyl...)
Affinity DataIC50:  2.50E+3nMpH: 7.8 T: 2°C. Assay description: Enzymatic activity of the isolated catalytic domains of wild type PDE5A1 and its deletion mutants was assayed by using [3H]cGMP as substrate in a rea...