BDBM16692 1-N-[(1R)-1-(4-fluorophenyl)ethyl]-5-(N-methylmethanesulfonamido)-3-N-[(2S)-1-{[(1S)-1-[(2-methylpropyl)carbamoyl]ethyl]amino}-3-phenylpropan-2-yl]benzene-1,3-dicarboxamide::psi[CH2NH] reduced amide isostere, 4b
SMILES CC(C)CNC(=O)[C@H](C)NC[C@H](Cc1ccccc1)NC(=O)c1cc(cc(c1)C(=O)N[C@H](C)c1ccc(F)cc1)N(C)S(C)(=O)=O
InChI Key InChIKey=FZTXBRKPIRTQCY-QEGDFHJFSA-N
Data  1 IC50
PDB links: 1 PDB ID matches this monomer.
  Tab Delimited (TSV)   2D SDfile   Computed 3D by Vconf -m prep SDfile
Find this compound or compounds like it in BindingDB:
Activity Spreadsheet -- Enzyme Inhibition Constant Data from BindingDB
Found 1 hit for monomerid = 16692
TargetBeta-secretase 1(Homo sapiens (Human))
Merck Research Laboratories
LigandPNGBDBM16692(1-N-[(1R)-1-(4-fluorophenyl)ethyl]-5-(N-methylmeth...)
Affinity DataIC50:  8nMpH: 4.5 T: 2°C. Assay description: The assay was performed using a 96-well format on a HPLC equipped with four 96-well plate holders. Test compounds were preincubated with enzymes for ...