BDBM174802 US10053462, 33::US9102686, 33::US9540388, 32
SMILES FC(F)(F)c1cccc(C(=O)N2[C@H]3CCC[C@@H]2c2nnc(-c4ccccn4)n2C3)c1Cl
InChI Key InChIKey=GJFWSWDCNPBEIO-BLLLJJGKSA-N
Data  10 KI  10 IC50
  Tab Delimited (TSV)   2D SDfile   Computed 3D by Vconf -m prep SDfile
Find this compound or compounds like it in BindingDB:
Activity Spreadsheet -- Enzyme Inhibition Constant Data from BindingDB
Found 14 hits for monomerid = 174802
TargetP2X purinoceptor 7(Rattus norvegicus (Rat))
Janssen Pharmaceutica
US Patent
LigandPNGBDBM174802(US10053462, 33 | US9102686, 33 | US9540388, 32)
Affinity DataKi:  3.20nM IC50:  11nMpH: 7.4Assay Description:1321N1 cells expressing the recombinant human or rat P2X7 channel was cultured in HyQ DME/(HyClone/Dulbecco's Modified Eagle Medium) high glucose...
In DepthDetails US Patent
TargetP2X purinoceptor 7(Homo sapiens (Human))
Janssen Pharmaceutica
US Patent
LigandPNGBDBM174802(US10053462, 33 | US9102686, 33 | US9540388, 32)
Affinity DataKi:  3.20nM IC50:  13nMpH: 7.4Assay Description:1321N1 cells expressing the recombinant human or rat P2X7 channel was cultured in HyQ DME/(HyClone/Dulbecco's Modified Eagle Medium) high glucose...
In DepthDetails US Patent
TargetP2X purinoceptor 7(Rattus norvegicus (Rat))
Janssen Pharmaceutica
US Patent
LigandPNGBDBM174802(US10053462, 33 | US9102686, 33 | US9540388, 32)
Affinity DataKi:  3.20nM. Assay description: Human or rat P2X7-1321N1 cells were collected and frozen @-80.degree. C. On the day of the experiment, cell membrane preparations were made according...
In DepthDetails US Patent
TargetP2X purinoceptor 7(Rattus norvegicus (Rat))
Janssen Pharmaceutica
US Patent
LigandPNGBDBM174802(US10053462, 33 | US9102686, 33 | US9540388, 32)
Affinity DataKi:  3.20nM IC50:  2.77E+3nM. Assay description: human or rat P2X7-1321N1 cells were collected and frozen @−80° C. On the day of the experiment, cell membrane preparations were made according ...
In DepthDetails US Patent
TargetP2X purinoceptor 7(Mus musculus)
Janssen Pharmaceutica
US Patent
LigandPNGBDBM174802(US10053462, 33 | US9102686, 33 | US9540388, 32)
Affinity DataKi:  3.20nM. Assay description: human or rat P2X7-1321N1 cells were collected and frozen @ −80° C. On the day of the experiment, cell membrane preparations were made according...
In DepthDetails US Patent
TargetP2X purinoceptor 7(Homo sapiens (Human))
Janssen Pharmaceutica
US Patent
LigandPNGBDBM174802(US10053462, 33 | US9102686, 33 | US9540388, 32)
Affinity DataKi:  6.30nM IC50:  1.51E+3nMpH: 7.4Assay Description:1321N1 cells expressing the recombinant human or rat P2X7 channel was cultured in HyQ DME/(HyClone/Dulbecco's Modified Eagle Medium) high glucose...
In DepthDetails US Patent
TargetP2X purinoceptor 7(Rattus norvegicus (Rat))
Janssen Pharmaceutica
US Patent
LigandPNGBDBM174802(US10053462, 33 | US9102686, 33 | US9540388, 32)
Affinity DataKi:  6.30nM IC50:  2.11E+3nMpH: 7.4Assay Description:1321N1 cells expressing the recombinant human or rat P2X7 channel was cultured in HyQ DME/(HyClone/Dulbecco's Modified Eagle Medium) high glucose...
In DepthDetails US Patent
TargetP2X purinoceptor 7(Homo sapiens (Human))
Janssen Pharmaceutica
US Patent
LigandPNGBDBM174802(US10053462, 33 | US9102686, 33 | US9540388, 32)
Affinity DataKi:  10.5nM. Assay description: Human or rat P2X7-1321N1 cells were collected and frozen @-80.degree. C. On the day of the experiment, cell membrane preparations were made according...
In DepthDetails US Patent
TargetP2X purinoceptor 7(Homo sapiens (Human))
Janssen Pharmaceutica
US Patent
LigandPNGBDBM174802(US10053462, 33 | US9102686, 33 | US9540388, 32)
Affinity DataKi:  10.5nM. Assay description: human or rat P2X7-1321N1 cells were collected and frozen @ −80° C. On the day of the experiment, cell membrane preparations were made according...
In DepthDetails US Patent
TargetP2X purinoceptor 7(Homo sapiens (Human))
Janssen Pharmaceutica
US Patent
LigandPNGBDBM174802(US10053462, 33 | US9102686, 33 | US9540388, 32)
Affinity DataKi:  11nM IC50:  2.77E+3nM. Assay description: human or rat P2X7-1321N1 cells were collected and frozen @−80° C. On the day of the experiment, cell membrane preparations were made according ...
In DepthDetails US Patent
TargetP2X purinoceptor 7(Mus musculus)
Janssen Pharmaceutica
US Patent
LigandPNGBDBM174802(US10053462, 33 | US9102686, 33 | US9540388, 32)
Affinity DataIC50:  11.3nMpH: 7.4Assay Description:1321N1 cells expressing the recombinant human or rat P2X7 channel was cultured in HyQ DME/(HyClone/Dulbecco's Modified Eagle Medium) high glucose...
In DepthDetails US Patent
TargetP2X purinoceptor 7(Rattus norvegicus (Rat))
Janssen Pharmaceutica
US Patent
LigandPNGBDBM174802(US10053462, 33 | US9102686, 33 | US9540388, 32)
Affinity DataIC50:  11.3nMpH: 7.4Assay Description:Ca.sup.2+flux: 1321N1 cells expressing the recombinant human, rat or mouse P2X7 channel was cultured in HyQ DME/(HyClone/Dulbecco's Modified Eagle Me...
In DepthDetails US Patent
TargetP2X purinoceptor 7(Homo sapiens (Human))
Janssen Pharmaceutica
US Patent
LigandPNGBDBM174802(US10053462, 33 | US9102686, 33 | US9540388, 32)
Affinity DataIC50:  13.4nMpH: 7.4Assay Description:Ca.sup.2+flux: 1321N1 cells expressing the recombinant human, rat or mouse P2X7 channel was cultured in HyQ DME/(HyClone/Dulbecco's Modified Eagle Me...
In DepthDetails US Patent
TargetP2X purinoceptor 7(Homo sapiens (Human))
Janssen Pharmaceutica
US Patent
LigandPNGBDBM174802(US10053462, 33 | US9102686, 33 | US9540388, 32)
Affinity DataIC50:  13.4nMpH: 7.4Assay Description:1321N1 cells expressing the recombinant human or rat P2X7 channel was cultured in HyQ DME/(HyClone/Dulbecco's Modified Eagle Medium) high glucose...
In DepthDetails US Patent