BDBM17854 3,5-Pyrazolediamine Inhibitor, 4::3-imino-4-[(E)-2-[2-(trifluoromethyl)phenyl]diazen-1-yl]-3H-pyrazol-5-amine
SMILES FC(F)(F)c1ccccc1NN=c1c(=N)nnc1=N
InChI Key InChIKey=AXVCAYVDTZRQAC-UHFFFAOYSA-N
Data  1 IC50
PDB links: 1 PDB ID matches this monomer.
  Tab Delimited (TSV)   2D SDfile   Computed 3D by Vconf -m prep SDfile
Find this compound or compounds like it in BindingDB:
Activity Spreadsheet -- Enzyme Inhibition Constant Data from BindingDB
Found 1 hit for monomerid = 17854
TargetMethionine aminopeptidase(Escherichia coli (strain K12))
The Procter & Gamble Pharmaceuticals
LigandPNGBDBM17854(3,5-Pyrazolediamine Inhibitor, 4 | 3-imino-4-[(E)-...)
Affinity DataIC50:  250nMpH: 7.5 T: 2°C. Assay description: The inhibitory activity of a compound toward EcMAP was measured by incubating the compound at various concentrations in the presence of the enzyme an...
Ligand InfoPC cidPC sidPDB