BDBM17860 3,5-Pyrazolediamine Inhibitor, 2::3-[(E)-2-(5-amino-3-imino-3H-pyrazol-4-yl)diazen-1-yl]benzoic acid
SMILES OC(=O)c1cccc(NN=c2c(=N)nnc2=N)c1
InChI Key InChIKey=MBYHOWWAJOLPNG-UHFFFAOYSA-N
Data  1 IC50
PDB links: 1 PDB ID matches this monomer.
  Tab Delimited (TSV)   2D SDfile   Computed 3D by Vconf -m prep SDfile
Find this compound or compounds like it in BindingDB:
Activity Spreadsheet -- Enzyme Inhibition Constant Data from BindingDB
Found 1 hit for monomerid = 17860
TargetMethionine aminopeptidase(Escherichia coli (strain K12))
The Procter & Gamble Pharmaceuticals
LigandPNGBDBM17860(3,5-Pyrazolediamine Inhibitor, 2 | 3-[(E)-2-(5-ami...)
Affinity DataIC50:  1.75E+3nMpH: 7.5 T: 2°C. Assay description: The inhibitory activity of a compound toward EcMAP was measured by incubating the compound at various concentrations in the presence of the enzyme an...