BDBM190665 US10759791, Compound 14g::nNOS inhibitor, 3
SMILES CN1CCN(CC1)c1cncc(CCc2cc(C)cc(N)n2)c1
InChI Key InChIKey=QJETXLUKROHQMG-UHFFFAOYSA-N
Data  15 KI
PDB links: 4 PDB IDs match this monomer.
  Tab Delimited (TSV)   2D SDfile   Computed 3D by Vconf -m prep SDfile
Find this compound or compounds like it in BindingDB:
Activity Spreadsheet -- Enzyme Inhibition Constant Data from BindingDB
Found 15 hits for monomerid = 190665
TargetNitric oxide synthase, brain(Rattus norvegicus (rat))
University Of California Irvine
LigandPNGBDBM190665(US10759791, Compound 14g | nNOS inhibitor, 3)
Affinity DataKi:  42.6nM ΔG°:  -10.5kcal/molepH: 7.4 T: 2°C. Assay description: The assay was performed at 37 °C in HEPES buffer (100 mM, with 10% glycerol, pH 7.4) in the presence of 10 uM L-arginine. Also included were 100 ...
TargetNitric oxide synthase, brain(Rattus norvegicus (rat))
University Of California Irvine
LigandPNGBDBM190665(US10759791, Compound 14g | nNOS inhibitor, 3)
Affinity DataKi:  43nM. Assay description: Inhibition of rat recombinant nNOS expressed in Escherichia coli using L-arginine as substrate assessed as reduction in NO production measured for 6 ...
TargetNitric oxide synthase, endothelial(Rattus norvegicus)
Northwestern University
US Patent
LigandPNGBDBM190665(US10759791, Compound 14g | nNOS inhibitor, 3)
Affinity DataKi:  43nM. Assay description: Enzyme inhibition was evaluated by measuring NO production with the hemoglobin capture assay, which was performed with purified NOSs in 96-well plate...
TargetNitric oxide synthase, brain(Rattus norvegicus (rat))
University Of California Irvine
LigandPNGBDBM190665(US10759791, Compound 14g | nNOS inhibitor, 3)
Affinity DataKi:  43nM. Assay description: Enzyme inhibition was evaluated by measuring NO production with the hemoglobin capture assay, which was performed with purified NOSs in 96-well plate...
TargetNitric oxide synthase, brain(Homo sapiens (Human))
Northwestern University
Curated by ChEMBL
LigandPNGBDBM190665(US10759791, Compound 14g | nNOS inhibitor, 3)
Affinity DataKi:  84nM. Assay description: Inhibition of human recombinant nNOS expressed in Escherichia coli using L-arginine as substrate assessed as reduction in NO production measured for ...
TargetNitric oxide synthase, brain(Homo sapiens (Human))
Northwestern University
Curated by ChEMBL
LigandPNGBDBM190665(US10759791, Compound 14g | nNOS inhibitor, 3)
Affinity DataKi:  84nM. Assay description: Enzyme inhibition was evaluated by measuring NO production with the hemoglobin capture assay, which was performed with purified NOSs in 96-well plate...
TargetNitric oxide synthase, brain(Homo sapiens (Human))
Northwestern University
Curated by ChEMBL
LigandPNGBDBM190665(US10759791, Compound 14g | nNOS inhibitor, 3)
Affinity DataKi:  84nM. Assay description: Enzyme inhibition was evaluated by measuring NO production with the hemoglobin capture assay, which was performed with purified NOSs in 96-well plate...
TargetIsoform PNNOS of Nitric oxide synthase, brain (PNNOS) -973,I269V,M336V,D597N](Rattus norvegicus (rats))
University Of California Irvine
LigandPNGBDBM190665(US10759791, Compound 14g | nNOS inhibitor, 3)
Affinity DataKi:  736nM ΔG°:  -8.70kcal/molepH: 7.4 T: 2°C. Assay description: The assay was performed at 37 °C in HEPES buffer (100 mM, with 10% glycerol, pH 7.4) in the presence of 10 uM L-arginine. Also included were 100 ...
TargetNitric oxide synthase, brain [D597N](Rattus norvegicus (rat))
University Of California Irvine
LigandPNGBDBM190665(US10759791, Compound 14g | nNOS inhibitor, 3)
Affinity DataKi:  748nM ΔG°:  -8.69kcal/molepH: 7.4 T: 2°C. Assay description: The assay was performed at 37 °C in HEPES buffer (100 mM, with 10% glycerol, pH 7.4) in the presence of 10 uM L-arginine. Also included were 100 ...
TargetNitric oxide synthase, inducible(Mus musculus (mouse))
Northwestern University
Curated by ChEMBL
LigandPNGBDBM190665(US10759791, Compound 14g | nNOS inhibitor, 3)
Affinity DataKi:  1.42E+4nM. Assay description: Inhibition of recombinant mouse macrophage iNOS expressed in Escherichia coli using L-arginine as substrate assessed as reduction in NO production me...
In DepthDetails ArticlePubMed
TargetNitric oxide synthase, inducible(Mus musculus (mouse))
Northwestern University
Curated by ChEMBL
LigandPNGBDBM190665(US10759791, Compound 14g | nNOS inhibitor, 3)
Affinity DataKi:  1.42E+4nM. Assay description: Enzyme inhibition was evaluated by measuring NO production with the hemoglobin capture assay, which was performed with purified NOSs in 96-well plate...
In DepthDetails US Patent
TargetNitric oxide synthase, endothelial(Bos taurus (bovine))
Northwestern University
Curated by ChEMBL
LigandPNGBDBM190665(US10759791, Compound 14g | nNOS inhibitor, 3)
Affinity DataKi: >3.00E+4nM. Assay description: Inhibition of bovine recombinant eNOS expressed in Escherichia coli using L-arginine as substrate assessed as reduction in NO production measured for...
TargetNitric oxide synthase, endothelial(Bos taurus (bovine))
Northwestern University
Curated by ChEMBL
LigandPNGBDBM190665(US10759791, Compound 14g | nNOS inhibitor, 3)
Affinity DataKi: >3.00E+4nM. Assay description: Enzyme inhibition was evaluated by measuring NO production with the hemoglobin capture assay, which was performed with purified NOSs in 96-well plate...
TargetNitric oxide synthase, endothelial(Homo sapiens (Human))
Northwestern University
US Patent
LigandPNGBDBM190665(US10759791, Compound 14g | nNOS inhibitor, 3)
Affinity DataKi:  7.30E+4nM. Assay description: Enzyme inhibition was evaluated by measuring NO production with the hemoglobin capture assay, which was performed with purified NOSs in 96-well plate...
TargetNitric oxide synthase, endothelial(Homo sapiens (Human))
Northwestern University
US Patent
LigandPNGBDBM190665(US10759791, Compound 14g | nNOS inhibitor, 3)
Affinity DataKi:  7.30E+4nM. Assay description: Inhibition of human recombinant eNOS expressed in Escherichia coli using L-arginine as substrate assessed as reduction in NO production measured for ...