BDBM202744 US10245267, Example 90::US10709712, Example 90::US9242969, 90::US9694016, 1172
SMILES FC(F)(F)c1cc(ccn1)C(=O)Nc1c[nH]c(=O)c(c1)-c1ccnc(c1)N1CCOCC1
InChI Key InChIKey=PDCWNMAIMBYGOD-UHFFFAOYSA-N
Data  20 IC50
  Tab Delimited (TSV)   2D SDfile   Computed 3D by Vconf -m prep SDfile
Find this compound or compounds like it in BindingDB:
Activity Spreadsheet -- Enzyme Inhibition Constant Data from BindingDB
Found 20 hits for monomerid = 202744
TargetSerine/threonine-protein kinase B-raf(Homo sapiens (Human))
Novartis
US Patent
LigandPNGBDBM202744(US10245267, Example 90 | US10709712, Example 90 | ...)
Affinity DataIC50: >2.50E+4nMpH: 7.5 T: 2°C. Assay description: Final assay conditions were 4 pM cRaf, 3 uM ATP, 10 nM biotin tagged MEK1 kinase dead protein substrate. Reactions were performed in Greiner384 well ...
Ligand InfoPC cidPC sid
In DepthDetails US Patent
TargetRAF proto-oncogene serine/threonine-protein kinase(Homo sapiens (Human))
Novartis
US Patent
LigandPNGBDBM202744(US10245267, Example 90 | US10709712, Example 90 | ...)
Affinity DataIC50:  2.50E+4nM. Assay description: C-Raf TR refers to a truncated C-Raf protein, a Δ1-324 deletion mutant.C-Raf FL refers to the full-length C-Raf protein.Full length MEK1 with an...
Ligand InfoPC cidPC sid
In DepthDetails US Patent
TargetSerine/threonine-protein kinase B-raf [V600E](Homo sapiens (Human))
Novartis
US Patent
LigandPNGBDBM202744(US10245267, Example 90 | US10709712, Example 90 | ...)
Affinity DataIC50: >2.50E+4nMpH: 7.5 T: 2°C. Assay description: Raf and biotinylated Mek, kinase dead, were combined at 2x final concentrations in assay buffer (50 mM Tris, pH 7.5, 15 mM MgCl2, 0.01% BSA and 1 mM ...
Ligand InfoPC cidPC sid
In DepthDetails US Patent
TargetRAF proto-oncogene serine/threonine-protein kinase [Y340E,Y341E](Homo sapiens (Human))
Novartis
US Patent
LigandPNGBDBM202744(US10245267, Example 90 | US10709712, Example 90 | ...)
Affinity DataIC50: >2.50E+4nMpH: 7.5 T: 2°C. Assay description: Raf and biotinylated Mek, kinase dead, were combined at 2x final concentrations in assay buffer (50 mM Tris, pH 7.5, 15 mM MgCl2, 0.01% BSA and 1 mM ...
Ligand InfoPC cidPC sid
In DepthDetails US Patent
TargetSerine/threonine-protein kinase B-raf [V600E](Homo sapiens (Human))
Novartis
US Patent
LigandPNGBDBM202744(US10245267, Example 90 | US10709712, Example 90 | ...)
Affinity DataIC50:  2.50E+4nMpH: 7.5 T: 2°C. Assay description: Raf and biotinylated Mek, kinase dead, were combined at 2x final concentrations in assay buffer (50 mM Tris, pH 7.5, 15 mM MgCl2, 0.01% BSA and 1 mM ...
Ligand InfoPC cidPC sid
In DepthDetails US Patent
TargetRAF proto-oncogene serine/threonine-protein kinase [Y340E,Y341E](Homo sapiens (Human))
Novartis
US Patent
LigandPNGBDBM202744(US10245267, Example 90 | US10709712, Example 90 | ...)
Affinity DataIC50:  2.50E+4nMpH: 7.5 T: 2°C. Assay description: Raf and biotinylated Mek, kinase dead, were combined at 2x final concentrations in assay buffer (50 mM Tris, pH 7.5, 15 mM MgCl2, 0.01% BSA and 1 mM ...
Ligand InfoPC cidPC sid
In DepthDetails US Patent
TargetSerine/threonine-protein kinase B-raf [V600E](Homo sapiens (Human))
Novartis
US Patent
LigandPNGBDBM202744(US10245267, Example 90 | US10709712, Example 90 | ...)
Affinity DataIC50:  2.50E+4nMpH: 7.5 T: 2°C. Assay description: Raf and biotinylated Mek, kinase dead, were combined at 2x final concentrations in assay buffer (50 mM Tris, pH 7.5, 15 mM MgCl2, 0.01% BSA and 1 mM ...
Ligand InfoPC cidPC sid
In DepthDetails US Patent
TargetRAF proto-oncogene serine/threonine-protein kinase [Y340E,Y341E](Homo sapiens (Human))
Novartis
US Patent
LigandPNGBDBM202744(US10245267, Example 90 | US10709712, Example 90 | ...)
Affinity DataIC50:  2.50E+4nMpH: 7.5 T: 2°C. Assay description: Raf and biotinylated Mek, kinase dead, were combined at 2x final concentrations in assay buffer (50 mM Tris, pH 7.5, 15 mM MgCl2, 0.01% BSA and 1 mM ...
Ligand InfoPC cidPC sid
In DepthDetails US Patent
TargetSerine/threonine-protein kinase B-raf [V600E](Homo sapiens (Human))
Novartis
US Patent
LigandPNGBDBM202744(US10245267, Example 90 | US10709712, Example 90 | ...)
Affinity DataIC50: >2.50E+4nM. Assay description: Raf and biotinylated Mek, kinase dead, were combined at 2× final concentrations in assay buffer (50 mM Tris, pH 7.5, 15 mM MgCl2, 0.01% BSA and 1 mM ...
Ligand InfoPC cidPC sid
In DepthDetails US Patent
TargetRAF proto-oncogene serine/threonine-protein kinase(Homo sapiens (Human))
Novartis
US Patent
LigandPNGBDBM202744(US10245267, Example 90 | US10709712, Example 90 | ...)
Affinity DataIC50: >2.50E+4nM. Assay description: Raf and biotinylated Mek, kinase dead, were combined at 2× final concentrations in assay buffer (50 mM Tris, pH 7.5, 15 mM MgCl2, 0.01% BSA and 1 mM ...
Ligand InfoPC cidPC sid
In DepthDetails US Patent
TargetSerine/threonine-protein kinase B-raf [V600E](Homo sapiens (Human))
Novartis
US Patent
LigandPNGBDBM202744(US10245267, Example 90 | US10709712, Example 90 | ...)
Affinity DataIC50:  2.50E+4nM. Assay description: Raf and biotinylated Mek, kinase dead, were combined at 2× final concentrations in assay buffer (50 mM Tris, pH 7.5, 15 mM MgCl2, 0.01% BSA and 1 mM ...
Ligand InfoPC cidPC sid
In DepthDetails US Patent
TargetRAF proto-oncogene serine/threonine-protein kinase(Homo sapiens (Human))
Novartis
US Patent
LigandPNGBDBM202744(US10245267, Example 90 | US10709712, Example 90 | ...)
Affinity DataIC50:  2.50E+4nM. Assay description: Raf and biotinylated Mek, kinase dead, were combined at 2× final concentrations in assay buffer (50 mM Tris, pH 7.5, 15 mM MgCl2, 0.01% BSA and 1 mM ...
Ligand InfoPC cidPC sid
In DepthDetails US Patent
TargetSerine/threonine-protein kinase B-raf [V600E](Homo sapiens (Human))
Novartis
US Patent
LigandPNGBDBM202744(US10245267, Example 90 | US10709712, Example 90 | ...)
Affinity DataIC50:  2.50E+4nM. Assay description: Raf and biotinylated Mek, kinase dead, were combined at 2× final concentrations in assay buffer (50 mM Tris, pH 7.5, 15 mM MgCl2, 0.01% BSA and 1 mM ...
Ligand InfoPC cidPC sid
In DepthDetails US Patent
TargetRAF proto-oncogene serine/threonine-protein kinase(Homo sapiens (Human))
Novartis
US Patent
LigandPNGBDBM202744(US10245267, Example 90 | US10709712, Example 90 | ...)
Affinity DataIC50:  2.50E+4nM. Assay description: Raf and biotinylated Mek, kinase dead, were combined at 2× final concentrations in assay buffer (50 mM Tris, pH 7.5, 15 mM MgCl2, 0.01% BSA and 1 mM ...
Ligand InfoPC cidPC sid
In DepthDetails US Patent
TargetSerine/threonine-protein kinase B-raf [V600E](Homo sapiens (Human))
Novartis
US Patent
LigandPNGBDBM202744(US10245267, Example 90 | US10709712, Example 90 | ...)
Affinity DataIC50:  2.50E+4nM. Assay description: C-Raf TR refers to a truncated C-Raf protein, a Δ1-324 deletion mutant.C-Raf FL refers to the full-length C-Raf protein.Full length MEK1 with an...
Ligand InfoPC cidPC sid
In DepthDetails US Patent
TargetRAF proto-oncogene serine/threonine-protein kinase(Homo sapiens (Human))
Novartis
US Patent
LigandPNGBDBM202744(US10245267, Example 90 | US10709712, Example 90 | ...)
Affinity DataIC50:  2.50E+4nM. Assay description: C-Raf TR refers to a truncated C-Raf protein, a Δ1-324 deletion mutant.C-Raf FL refers to the full-length C-Raf protein.Full length MEK1 with an...
Ligand InfoPC cidPC sid
In DepthDetails US Patent
TargetSerine/threonine-protein kinase B-raf [V600E](Homo sapiens (Human))
Novartis
US Patent
LigandPNGBDBM202744(US10245267, Example 90 | US10709712, Example 90 | ...)
Affinity DataIC50: >2.50E+4nM. Assay description: C-Raf TR refers to a truncated C-Raf protein, a Δ1-324 deletion mutant.C-Raf FL refers to the full-length C-Raf protein.Full length MEK1 with an...
Ligand InfoPC cidPC sid
In DepthDetails US Patent
TargetRAF proto-oncogene serine/threonine-protein kinase(Homo sapiens (Human))
Novartis
US Patent
LigandPNGBDBM202744(US10245267, Example 90 | US10709712, Example 90 | ...)
Affinity DataIC50: >2.50E+4nM. Assay description: C-Raf TR refers to a truncated C-Raf protein, a Δ1-324 deletion mutant.C-Raf FL refers to the full-length C-Raf protein.Full length MEK1 with an...
Ligand InfoPC cidPC sid
In DepthDetails US Patent
TargetSerine/threonine-protein kinase B-raf [V600E](Homo sapiens (Human))
Novartis
US Patent
LigandPNGBDBM202744(US10245267, Example 90 | US10709712, Example 90 | ...)
Affinity DataIC50:  2.50E+4nM. Assay description: C-Raf TR refers to a truncated C-Raf protein, a Δ1-324 deletion mutant.C-Raf FL refers to the full-length C-Raf protein.Full length MEK1 with an...
Ligand InfoPC cidPC sid
In DepthDetails US Patent
TargetRAF proto-oncogene serine/threonine-protein kinase [Y340E,Y341E](Homo sapiens (Human))
Novartis
US Patent
LigandPNGBDBM202744(US10245267, Example 90 | US10709712, Example 90 | ...)
Affinity DataIC50: >2.50E+4nMpH: 7.5 T: 2°C. Assay description: Final assay conditions were 4 pM cRaf, 3 uM ATP, 10 nM biotin tagged MEK1 kinase dead protein substrate. Reactions were performed in Greiner384 well ...
Ligand InfoPC cidPC sid
In DepthDetails US Patent