BDBM210834 US9290467, 4
SMILES Clc1cc2C[C@H](NC(=O)c3ccccc3OC\C=C\COc1cc2)C(=O)NC1(CC1)C#N
InChI Key InChIKey=DAGMBGOOMHAGIF-RTLBZRNLSA-N
Data  1 IC50
PDB links: 2 PDB IDs match this monomer.
  Tab Delimited (TSV)   2D SDfile   Computed 3D by Vconf -m prep SDfile
Find this compound or compounds like it in BindingDB:
Activity Spreadsheet -- Enzyme Inhibition Constant Data from BindingDB
Found 1 hit for monomerid = 210834
TargetProcathepsin L(Homo sapiens (Human))
Hoffmann-La Roche
US Patent
LigandPNGBDBM210834(US9290467, 4)
Affinity DataIC50:  13.8nMpH: 6.5Assay Description:Enzyme activity is measured by observing the increase in fluorescence intensity caused by cleavage of a peptide substrate containing a fluorophore wh...
Ligand InfoPC cidPC sidPDB