BDBM22459 2-(cyclooctylamino)-5-methyl-5-propyl-4,5-dihydro-1,3-thiazol-4-one::2-Amino-1,3-thiazol-4(5H)-one, 6d
SMILES CCCC1(C)SC(NC2CCCCCCC2)=NC1=O
InChI Key InChIKey=SBTHYUAUBLEDJY-UHFFFAOYSA-N
Data  1 KI  1 IC50
PDB links: 1 PDB ID matches this monomer.
  Tab Delimited (TSV)   2D SDfile   Computed 3D by Vconf -m prep SDfile
Find this compound or compounds like it in BindingDB:
Activity Spreadsheet -- Enzyme Inhibition Constant Data from BindingDB
Found 2 hits for monomerid = 22459
Target11-beta-hydroxysteroid dehydrogenase 1(Homo sapiens (Human))
Biovitrum
LigandPNGBDBM22459(2-(cyclooctylamino)-5-methyl-5-propyl-4,5-dihydro-...)
Affinity DataKi:  28nM ΔG°:  -10.2kcal/molepH: 7.2 T: 2°C. Assay description: The 11beta-HSD1 enzyme assay was carried out in the replica plates of the compounds in reaction buffer containing substrate mixture [3H]-cortisone/NA...
Target11-beta-hydroxysteroid dehydrogenase type 2(Homo sapiens (Human))
Biovitrum
LigandPNGBDBM22459(2-(cyclooctylamino)-5-methyl-5-propyl-4,5-dihydro-...)
Affinity DataIC50: >1.00E+4nM. Assay description: The assay was performed at room temperature in a 96-well microtiter plate containing substrate mixture [3H]cortisol/NAD+, inhibitors, and 11beta-HSD2...
In DepthDetails ArticlePubMed