BDBM225392 Sacchettini_11
SMILES Cc1ccc(F)c(C(=O)CC(=O)C(O)=O)c1Cl
InChI Key InChIKey=ZIEFMRIMKUUCBZ-UHFFFAOYSA-N
Data  1 IC50
PDB links: 1 PDB ID matches this monomer.
  Tab Delimited (TSV)   2D SDfile   Computed 3D by Vconf -m prep SDfile
Find this compound or compounds like it in BindingDB:
Activity Spreadsheet -- Enzyme Inhibition Constant Data from BindingDB
Found 1 hit for monomerid = 225392
TargetMalate synthase G [C619A](Mycobacterium tuberculosis (strain CDC 1551 / Oshk...)
D3R/Abbott
LigandPNGBDBM225392(Sacchettini_11)
Affinity DataIC50:  5.50E+3nM. Assay description: DNTB-Coupled_Enzyme_Assay