BDBM255800 5-{3-[1-(4-Amino-3-methyl-1H-pyrazolo[3,4-d]pyrimidin-1-yl)ethyl]-5-chloro-2-methoxy-6-methylphenyl}-N,N-dimethylpyridine-2-carboxamide bis(trifluoroacetate)::US10092570, Example 11::US10376513, Example 167::US10646492, Example 167::US11433071, Example 66::US9707233, 11::US9707233, 167::US9707233, 41::US9707233, 42::US9707233, 66::US9730939, Example 167::US9932341, Example 167
SMILES COc1c(cc(Cl)c(C)c1-c1ccc(nc1)C(=O)N(C)C)C(C)n1nc(C)c2c(N)ncnc12
InChI Key InChIKey=CEECNMYKERBUGO-UHFFFAOYSA-N
Data  23 IC50
  Tab Delimited (TSV)   2D SDfile   Computed 3D by Vconf -m prep SDfile
Find this compound or compounds like it in BindingDB:
Activity Spreadsheet -- Enzyme Inhibition Constant Data from BindingDB
Found 23 hits for monomerid = 255800
LigandPNGBDBM255800(5-{3-[1-(4-Amino-3-methyl-1H-pyrazolo[3,4-d]pyrimi...)
Affinity DataIC50: <10nMpH: 6.7 T: 2°C. Assay description: Lipid kinase substrate, phosphoinositol-4,5-bisphosphate (PIP2), are purchased from Echelon Biosciences (Salt Lake City, Utah). PI3K isoforms α,...
Ligand InfoPC cidPC sid
In DepthDetails US Patent
LigandPNGBDBM255800(5-{3-[1-(4-Amino-3-methyl-1H-pyrazolo[3,4-d]pyrimi...)
Affinity DataIC50: <10nM. Assay description: The kinase reaction was conducted in polystyrene 384-well matrix white plate from Thermo Fisher Scientific in a final volume of 25 μL. Inhibitor...
Ligand InfoPC cidPC sid
In DepthDetails US Patent
LigandPNGBDBM255800(5-{3-[1-(4-Amino-3-methyl-1H-pyrazolo[3,4-d]pyrimi...)
Affinity DataIC50: <10nMpH: 6.7 T: 2°C. Assay description: Lipid kinase substrate, phosphoinositol-4,5-bisphosphate (PIP2), are purchased from Echelon Biosciences (Salt Lake City, Utah). PI3K isoforms α,...
Ligand InfoPC cidPC sid
In DepthDetails US Patent
LigandPNGBDBM255800(5-{3-[1-(4-Amino-3-methyl-1H-pyrazolo[3,4-d]pyrimi...)
Affinity DataIC50: <10nMpH: 6.7 T: 2°C. Assay description: Lipid kinase substrate, phosphoinositol-4,5-bisphosphate (PIP2), are purchased from Echelon Biosciences (Salt Lake City, Utah). PI3K isoforms α,...
Ligand InfoPC cidPC sid
In DepthDetails US Patent
LigandPNGBDBM255800(5-{3-[1-(4-Amino-3-methyl-1H-pyrazolo[3,4-d]pyrimi...)
Affinity DataIC50: <10nMpH: 6.7 T: 2°C. Assay description: Lipid kinase substrate, phosphoinositol-4,5-bisphosphate (PIP2), are purchased from Echelon Biosciences (Salt Lake City, Utah). PI3K isoforms α,...
Ligand InfoPC cidPC sid
In DepthDetails US Patent
LigandPNGBDBM255800(5-{3-[1-(4-Amino-3-methyl-1H-pyrazolo[3,4-d]pyrimi...)
Affinity DataIC50: <10nMpH: 6.7 T: 2°C. Assay description: [γ-33P]ATP (10 mCi/mL) was purchased from Perkin-Elmer (Waltham, Mass.). Lipid kinase substrate, D-myo-Phosphatidylinositol 4,5-bisphosphate (Pt...
Ligand InfoPC cidPC sid
In DepthDetails US Patent
LigandPNGBDBM255800(5-{3-[1-(4-Amino-3-methyl-1H-pyrazolo[3,4-d]pyrimi...)
Affinity DataIC50: <10nMpH: 6.7 T: 2°C. Assay description: [γ-33P]ATP (10 mCi/mL) was purchased from Perkin-Elmer (Waltham, Mass.). Lipid kinase substrate, D-myo-Phosphatidylinositol 4,5-bisphosphate (Pt...
Ligand InfoPC cidPC sid
In DepthDetails US Patent
LigandPNGBDBM255800(5-{3-[1-(4-Amino-3-methyl-1H-pyrazolo[3,4-d]pyrimi...)
Affinity DataIC50: <10nMpH: 6.7 T: 2°C. Assay description: [γ-33P]ATP (10 mCi/mL) was purchased from Perkin-Elmer (Waltham, Mass.). Lipid kinase substrate, D-myo-Phosphatidylinositol 4,5-bisphosphate (Pt...
Ligand InfoPC cidPC sid
In DepthDetails US Patent
LigandPNGBDBM255800(5-{3-[1-(4-Amino-3-methyl-1H-pyrazolo[3,4-d]pyrimi...)
Affinity DataIC50: <10nM. Assay description: [γ-33P]ATP (10 mCi/mL) was purchased from PerkinElmer (Waltham, Mass.). Lipid kinase substrate, D-myo-Phosphatidylinositol 4,5-bisphosphate (Ptd...
Ligand InfoPC cidPC sid
In DepthDetails US Patent
LigandPNGBDBM255800(5-{3-[1-(4-Amino-3-methyl-1H-pyrazolo[3,4-d]pyrimi...)
Affinity DataIC50: <10nM. Assay description: [γ-33P]ATP (10 mCi/mL) was purchased from PerkinElmer (Waltham, Mass.). Lipid kinase substrate, D-myo-Phosphatidylinositol 4,5-bisphosphate (Ptd...
Ligand InfoPC cidPC sid
In DepthDetails US Patent
LigandPNGBDBM255800(5-{3-[1-(4-Amino-3-methyl-1H-pyrazolo[3,4-d]pyrimi...)
Affinity DataIC50: <10nM. Assay description: The kinase reaction was conducted in polystyrene 384-well matrix white plate from Thermo Fisher Scientific in a final volume of 25 uL. Inhibitors wer...
Ligand InfoPC cidPC sid
In DepthDetails US Patent
LigandPNGBDBM255800(5-{3-[1-(4-Amino-3-methyl-1H-pyrazolo[3,4-d]pyrimi...)
Affinity DataIC50: <10nM. Assay description: The kinase reaction was conducted in polystyrene 384-well matrix white plate from Thermo Fisher Scientific in a final volume of 25 uL. Inhibitors wer...
Ligand InfoPC cidPC sid
In DepthDetails US Patent
LigandPNGBDBM255800(5-{3-[1-(4-Amino-3-methyl-1H-pyrazolo[3,4-d]pyrimi...)
Affinity DataIC50: <10nM. Assay description: The kinase reaction was conducted in polystyrene 384-well matrix white plate from Thermo Fisher Scientific in a final volume of 25 uL. Inhibitors wer...
Ligand InfoPC cidPC sid
In DepthDetails US Patent
LigandPNGBDBM255800(5-{3-[1-(4-Amino-3-methyl-1H-pyrazolo[3,4-d]pyrimi...)
Affinity DataIC50: <10nM. Assay description: [γ-33P]ATP (10 mCi/mL) was purchased from Perkin-Elmer (Waltham, Mass.). Lipid kinase substrate, D-myo-Phosphatidylinositol 4,5-bisphosphate (Pt...
Ligand InfoPC cidPC sid
In DepthDetails US Patent
LigandPNGBDBM255800(5-{3-[1-(4-Amino-3-methyl-1H-pyrazolo[3,4-d]pyrimi...)
Affinity DataIC50:  375nM. Assay description: [γ-33P]ATP (10 mCi/mL) was purchased from Perkin-Elmer (Waltham, Mass.). Lipid kinase substrate, D-myo-Phosphatidylinositol 4,5-bisphosphate (Pt...
Ligand InfoPC cidPC sid
In DepthDetails US Patent
LigandPNGBDBM255800(5-{3-[1-(4-Amino-3-methyl-1H-pyrazolo[3,4-d]pyrimi...)
Affinity DataIC50: <10nM. Assay description: [γ-33P]ATP (10 mCi/mL) was purchased from Perkin-Elmer (Waltham, Mass.). Lipid kinase substrate, D-myo-Phosphatidylinositol 4,5-bisphosphate (Pt...
Ligand InfoPC cidPC sid
In DepthDetails US Patent
LigandPNGBDBM255800(5-{3-[1-(4-Amino-3-methyl-1H-pyrazolo[3,4-d]pyrimi...)
Affinity DataIC50: <10nM. Assay description: [γ-33P]ATP (10 mCi/mL) was purchased from Perkin-Elmer (Waltham, Mass.). Lipid kinase substrate, D-myo-Phosphatidylinositol 4,5-bisphosphate (Pt...
Ligand InfoPC cidPC sid
In DepthDetails US Patent
LigandPNGBDBM255800(5-{3-[1-(4-Amino-3-methyl-1H-pyrazolo[3,4-d]pyrimi...)
Affinity DataIC50: <10nM. Assay description: The kinase reaction was conducted in polystyrene 384-well matrix white plate from Thermo Fisher Scientific in a final volume of 25 uL. Inhibitors wer...
Ligand InfoPC cidPC sid
In DepthDetails US Patent
LigandPNGBDBM255800(5-{3-[1-(4-Amino-3-methyl-1H-pyrazolo[3,4-d]pyrimi...)
Affinity DataIC50: <10nM. Assay description: The kinase reaction was conducted in polystyrene 384-well matrix white plate from Thermo Fisher Scientific in a final volume of 25 uL. Inhibitors wer...
Ligand InfoPC cidPC sid
In DepthDetails US Patent
LigandPNGBDBM255800(5-{3-[1-(4-Amino-3-methyl-1H-pyrazolo[3,4-d]pyrimi...)
Affinity DataIC50: <10nM. Assay description: The kinase reaction was conducted in polystyrene 384-well matrix white plate from Thermo Fisher Scientific in a final volume of 25 uL. Inhibitors wer...
Ligand InfoPC cidPC sid
In DepthDetails US Patent
LigandPNGBDBM255800(5-{3-[1-(4-Amino-3-methyl-1H-pyrazolo[3,4-d]pyrimi...)
Affinity DataIC50: <10nM. Assay description: The kinase reaction was conducted in polystyrene 384-well matrix white plate from Thermo Fisher Scientific in a final volume of 25 μL. Inhibitor...
Ligand InfoPC cidPC sid
In DepthDetails US Patent
LigandPNGBDBM255800(5-{3-[1-(4-Amino-3-methyl-1H-pyrazolo[3,4-d]pyrimi...)
Affinity DataIC50: <10nM. Assay description: The kinase reaction was conducted in polystyrene 384-well matrix white plate from Thermo Fisher Scientific in a final volume of 25 μL. Inhibitor...
Ligand InfoPC cidPC sid
In DepthDetails US Patent
LigandPNGBDBM255800(5-{3-[1-(4-Amino-3-methyl-1H-pyrazolo[3,4-d]pyrimi...)
Affinity DataIC50:  125nMpH: 6.7 T: 2°C. Assay description: Lipid kinase substrate, phosphoinositol-4,5-bisphosphate (PIP2), are purchased from Echelon Biosciences (Salt Lake City, Utah). PI3K isoforms α,...
Ligand InfoPC cidPC sid
In DepthDetails US Patent