BDBM261958 3-(2,6-difluoro-3,5- dimethoxyphenyl)-7-(1,3- dimethyl-1H-pyrazol-4-yl)-1- ((2-methoxypyridin-4- yl)methyl)-3,4- dihydropyrido[4,3-d]pyrimidin- 2(1H)-one::US10251892, Example 58::US10632126, Example 58::US11173162, Example 58::US9708318, 58
SMILES COc1cc(CN2C(=O)N(Cc3cnc(cc23)-c2cn(C)nc2C)c2c(F)c(OC)cc(OC)c2F)ccn1
InChI Key InChIKey=XIANNVXWWHLKRY-UHFFFAOYSA-N
Data  28 IC50
  Tab Delimited (TSV)   2D SDfile   Computed 3D by Vconf -m prep SDfile
Find this compound or compounds like it in BindingDB:
Activity Spreadsheet -- Enzyme Inhibition Constant Data from BindingDB
Found 28 hits for monomerid = 261958
TargetFibroblast growth factor receptor 1(Homo sapiens (Human))
Incyte
US Patent
LigandPNGBDBM261958(3-(2,6-difluoro-3,5- dimethoxyphenyl)-7-(1,3- dime...)
Affinity DataIC50:  115nM. Assay description: FGFR1, FGFR2, and FGFR4 are measured under equivalent conditions with the following changes in enzyme and ATP concentrations: FGFR1, 0.02 nM and 210 ...
Ligand InfoPC cidPC sid
In DepthDetails US Patent
TargetFibroblast growth factor receptor 4(Homo sapiens (Human))
Incyte
US Patent
LigandPNGBDBM261958(3-(2,6-difluoro-3,5- dimethoxyphenyl)-7-(1,3- dime...)
Affinity DataIC50:  20nM. Assay description: The inhibitor potency of the exemplified compounds was measured in an enzyme assay that measures peptide phosphorylation using FRET measurements to d...
Ligand InfoPC cidPC sid
In DepthDetails US Patent
TargetFibroblast growth factor receptor 3(Homo sapiens (Human))
Incyte
US Patent
LigandPNGBDBM261958(3-(2,6-difluoro-3,5- dimethoxyphenyl)-7-(1,3- dime...)
Affinity DataIC50: <10nM. Assay description: FGFR1, FGFR2, and FGFR4 are measured under equivalent conditions with the following changes in enzyme and ATP concentrations: FGFR1, 0.02 nM and 210 ...
Ligand InfoPC cidPC sid
In DepthDetails US Patent
TargetFibroblast growth factor receptor 4(Homo sapiens (Human))
Incyte
US Patent
LigandPNGBDBM261958(3-(2,6-difluoro-3,5- dimethoxyphenyl)-7-(1,3- dime...)
Affinity DataIC50:  20nM. Assay description: FGFR1, FGFR2, and FGFR4 are measured under equivalent conditions with the following changes in enzyme and ATP concentrations: FGFR1, 0.02 nM and 210 ...
Ligand InfoPC cidPC sid
In DepthDetails US Patent
TargetFibroblast growth factor receptor 1(Homo sapiens (Human))
Incyte
US Patent
LigandPNGBDBM261958(3-(2,6-difluoro-3,5- dimethoxyphenyl)-7-(1,3- dime...)
Affinity DataIC50:  20nM. Assay description: FGFR1, FGFR2, and FGFR4 are measured under equivalent conditions with the following changes in enzyme and ATP concentrations: FGFR1, 0.02 nM and 210 ...
Ligand InfoPC cidPC sid
In DepthDetails US Patent
TargetFibroblast growth factor receptor 2(Homo sapiens (Human))
Incyte
US Patent
LigandPNGBDBM261958(3-(2,6-difluoro-3,5- dimethoxyphenyl)-7-(1,3- dime...)
Affinity DataIC50: <10nM. Assay description: FGFR1, FGFR2, and FGFR4 are measured under equivalent conditions with the following changes in enzyme and ATP concentrations: FGFR1, 0.02 nM and 210 ...
Ligand InfoPC cidPC sid
In DepthDetails US Patent
TargetFibroblast growth factor receptor 3(Homo sapiens (Human))
Incyte
US Patent
LigandPNGBDBM261958(3-(2,6-difluoro-3,5- dimethoxyphenyl)-7-(1,3- dime...)
Affinity DataIC50: <10nM. Assay description: FGFR1, FGFR2, and FGFR4 are measured under equivalent conditions with the following changes in enzyme and ATP concentrations: FGFR1, 0.02 nM and 210 ...
Ligand InfoPC cidPC sid
In DepthDetails US Patent
TargetFibroblast growth factor receptor 4(Homo sapiens (Human))
Incyte
US Patent
LigandPNGBDBM261958(3-(2,6-difluoro-3,5- dimethoxyphenyl)-7-(1,3- dime...)
Affinity DataIC50:  20nM. Assay description: FGFR1, FGFR2, and FGFR4 are measured under equivalent conditions with the following changes in enzyme and ATP concentrations: FGFR1, 0.02 nM and 210 ...
Ligand InfoPC cidPC sid
In DepthDetails US Patent
TargetFibroblast growth factor receptor 1(Homo sapiens (Human))
Incyte
US Patent
LigandPNGBDBM261958(3-(2,6-difluoro-3,5- dimethoxyphenyl)-7-(1,3- dime...)
Affinity DataIC50:  115nM. Assay description: The inhibitor potency of the exemplified compounds was measured in an enzyme assay that measures peptide phosphorylation using FRET measurements to d...
Ligand InfoPC cidPC sid
In DepthDetails US Patent
TargetFibroblast growth factor receptor 2(Homo sapiens (Human))
Incyte
US Patent
LigandPNGBDBM261958(3-(2,6-difluoro-3,5- dimethoxyphenyl)-7-(1,3- dime...)
Affinity DataIC50: <10nM. Assay description: The inhibitor potency of the exemplified compounds was measured in an enzyme assay that measures peptide phosphorylation using FRET measurements to d...
Ligand InfoPC cidPC sid
In DepthDetails US Patent
TargetFibroblast growth factor receptor 3(Homo sapiens (Human))
Incyte
US Patent
LigandPNGBDBM261958(3-(2,6-difluoro-3,5- dimethoxyphenyl)-7-(1,3- dime...)
Affinity DataIC50: <10nM. Assay description: The inhibitor potency of the exemplified compounds was measured in an enzyme assay that measures peptide phosphorylation using FRET measurements to d...
Ligand InfoPC cidPC sid
In DepthDetails US Patent
TargetFibroblast growth factor receptor 4(Homo sapiens (Human))
Incyte
US Patent
LigandPNGBDBM261958(3-(2,6-difluoro-3,5- dimethoxyphenyl)-7-(1,3- dime...)
Affinity DataIC50:  20nM. Assay description: The inhibitor potency of the exemplified compounds was measured in an enzyme assay that measures peptide phosphorylation using FRET measurements to d...
Ligand InfoPC cidPC sid
In DepthDetails US Patent
TargetFibroblast growth factor receptor 1(Homo sapiens (Human))
Incyte
US Patent
LigandPNGBDBM261958(3-(2,6-difluoro-3,5- dimethoxyphenyl)-7-(1,3- dime...)
Affinity DataIC50:  20nM. Assay description: In the FGFR Enzymatic Assay after dilution in assay buffer, added to the plate and pre-incubated for 5 to 10 minutes.
Ligand InfoPC cidPC sid
In DepthDetails US Patent
TargetFibroblast growth factor receptor 2(Homo sapiens (Human))
Incyte
US Patent
LigandPNGBDBM261958(3-(2,6-difluoro-3,5- dimethoxyphenyl)-7-(1,3- dime...)
Affinity DataIC50: <10nM. Assay description: In the FGFR Enzymatic Assay after dilution in assay buffer, added to the plate and pre-incubated for 5 to 10 minutes.
Ligand InfoPC cidPC sid
In DepthDetails US Patent
TargetFibroblast growth factor receptor 3(Homo sapiens (Human))
Incyte
US Patent
LigandPNGBDBM261958(3-(2,6-difluoro-3,5- dimethoxyphenyl)-7-(1,3- dime...)
Affinity DataIC50: <10nM. Assay description: In the FGFR Enzymatic Assay after dilution in assay buffer, added to the plate and pre-incubated for 5 to 10 minutes.
Ligand InfoPC cidPC sid
In DepthDetails US Patent
TargetFibroblast growth factor receptor 4(Homo sapiens (Human))
Incyte
US Patent
LigandPNGBDBM261958(3-(2,6-difluoro-3,5- dimethoxyphenyl)-7-(1,3- dime...)
Affinity DataIC50:  20nM. Assay description: In the FGFR Enzymatic Assay after dilution in assay buffer, added to the plate and pre-incubated for 5 to 10 minutes.
Ligand InfoPC cidPC sid
In DepthDetails US Patent
TargetFibroblast growth factor receptor 1(Homo sapiens (Human))
Incyte
US Patent
LigandPNGBDBM261958(3-(2,6-difluoro-3,5- dimethoxyphenyl)-7-(1,3- dime...)
Affinity DataIC50:  115nM. Assay description: The inhibitor potency of the exemplified compounds was measured in an enzyme assay that measures peptide phosphorylation using FRET measurements to d...
Ligand InfoPC cidPC sid
In DepthDetails US Patent
TargetFibroblast growth factor receptor 2(Homo sapiens (Human))
Incyte
US Patent
LigandPNGBDBM261958(3-(2,6-difluoro-3,5- dimethoxyphenyl)-7-(1,3- dime...)
Affinity DataIC50: <10nM. Assay description: The inhibitor potency of the exemplified compounds was measured in an enzyme assay that measures peptide phosphorylation using FRET measurements to d...
Ligand InfoPC cidPC sid
In DepthDetails US Patent
TargetFibroblast growth factor receptor 3(Homo sapiens (Human))
Incyte
US Patent
LigandPNGBDBM261958(3-(2,6-difluoro-3,5- dimethoxyphenyl)-7-(1,3- dime...)
Affinity DataIC50: <10nM. Assay description: The inhibitor potency of the exemplified compounds was measured in an enzyme assay that measures peptide phosphorylation using FRET measurements to d...
Ligand InfoPC cidPC sid
In DepthDetails US Patent
TargetFibroblast growth factor receptor 4(Homo sapiens (Human))
Incyte
US Patent
LigandPNGBDBM261958(3-(2,6-difluoro-3,5- dimethoxyphenyl)-7-(1,3- dime...)
Affinity DataIC50:  20nM. Assay description: The inhibitor potency of the exemplified compounds was measured in an enzyme assay that measures peptide phosphorylation using FRET measurements to d...
Ligand InfoPC cidPC sid
In DepthDetails US Patent
TargetFibroblast growth factor receptor 1(Homo sapiens (Human))
Incyte
US Patent
LigandPNGBDBM261958(3-(2,6-difluoro-3,5- dimethoxyphenyl)-7-(1,3- dime...)
Affinity DataIC50:  115nM. Assay description: The inhibitor potency of the exemplified compounds was measured in an enzyme assay that measures peptide phosphorylation using FRET measurements to d...
Ligand InfoPC cidPC sid
In DepthDetails US Patent
TargetFibroblast growth factor receptor 2(Homo sapiens (Human))
Incyte
US Patent
LigandPNGBDBM261958(3-(2,6-difluoro-3,5- dimethoxyphenyl)-7-(1,3- dime...)
Affinity DataIC50: <10nM. Assay description: The inhibitor potency of the exemplified compounds was measured in an enzyme assay that measures peptide phosphorylation using FRET measurements to d...
Ligand InfoPC cidPC sid
In DepthDetails US Patent
TargetFibroblast growth factor receptor 3(Homo sapiens (Human))
Incyte
US Patent
LigandPNGBDBM261958(3-(2,6-difluoro-3,5- dimethoxyphenyl)-7-(1,3- dime...)
Affinity DataIC50: <10nM. Assay description: The inhibitor potency of the exemplified compounds was measured in an enzyme assay that measures peptide phosphorylation using FRET measurements to d...
Ligand InfoPC cidPC sid
In DepthDetails US Patent
TargetFibroblast growth factor receptor 4(Homo sapiens (Human))
Incyte
US Patent
LigandPNGBDBM261958(3-(2,6-difluoro-3,5- dimethoxyphenyl)-7-(1,3- dime...)
Affinity DataIC50:  20nM. Assay description: The inhibitor potency of the exemplified compounds was measured in an enzyme assay that measures peptide phosphorylation using FRET measurements to d...
Ligand InfoPC cidPC sid
In DepthDetails US Patent
TargetFibroblast growth factor receptor 1(Homo sapiens (Human))
Incyte
US Patent
LigandPNGBDBM261958(3-(2,6-difluoro-3,5- dimethoxyphenyl)-7-(1,3- dime...)
Affinity DataIC50:  20nM. Assay description: The inhibitor potency of the exemplified compounds was measured in an enzyme assay that measures peptide phosphorylation using FRET measurements to d...
Ligand InfoPC cidPC sid
In DepthDetails US Patent
TargetFibroblast growth factor receptor 2(Homo sapiens (Human))
Incyte
US Patent
LigandPNGBDBM261958(3-(2,6-difluoro-3,5- dimethoxyphenyl)-7-(1,3- dime...)
Affinity DataIC50: <10nM. Assay description: The inhibitor potency of the exemplified compounds was measured in an enzyme assay that measures peptide phosphorylation using FRET measurements to d...
Ligand InfoPC cidPC sid
In DepthDetails US Patent
TargetFibroblast growth factor receptor 3(Homo sapiens (Human))
Incyte
US Patent
LigandPNGBDBM261958(3-(2,6-difluoro-3,5- dimethoxyphenyl)-7-(1,3- dime...)
Affinity DataIC50: <10nM. Assay description: The inhibitor potency of the exemplified compounds was measured in an enzyme assay that measures peptide phosphorylation using FRET measurements to d...
Ligand InfoPC cidPC sid
In DepthDetails US Patent
TargetFibroblast growth factor receptor 2(Homo sapiens (Human))
Incyte
US Patent
LigandPNGBDBM261958(3-(2,6-difluoro-3,5- dimethoxyphenyl)-7-(1,3- dime...)
Affinity DataIC50: <10nM. Assay description: FGFR1, FGFR2, and FGFR4 are measured under equivalent conditions with the following changes in enzyme and ATP concentrations: FGFR1, 0.02 nM and 210 ...
Ligand InfoPC cidPC sid
In DepthDetails US Patent