BDBM262050 US10251892, Example 168::US10632126, Example 168::US11173162, Example 168::US9708318, 168
SMILES CCN1C(=O)N(Cc2cnc(cc12)-c1cn(CC)nc1C)c1c(F)c(OC)cc(OC)c1F
InChI Key InChIKey=YNIUDUJHMLLLQL-UHFFFAOYSA-N
Data  28 IC50
  Tab Delimited (TSV)   2D SDfile   Computed 3D by Vconf -m prep SDfile
Find this compound or compounds like it in BindingDB:
Activity Spreadsheet -- Enzyme Inhibition Constant Data from BindingDB
Found 28 hits for monomerid = 262050
TargetFibroblast growth factor receptor 1(Homo sapiens (Human))
Incyte
US Patent
LigandPNGBDBM262050(US10251892, Example 168 | US10632126, Example 168 ...)
Affinity DataIC50:  20nM. Assay description: FGFR1, FGFR2, and FGFR4 are measured under equivalent conditions with the following changes in enzyme and ATP concentrations: FGFR1, 0.02 nM and 210 ...
Ligand InfoPC cidPC sid
In DepthDetails US Patent
TargetFibroblast growth factor receptor 4(Homo sapiens (Human))
Incyte
US Patent
LigandPNGBDBM262050(US10251892, Example 168 | US10632126, Example 168 ...)
Affinity DataIC50:  20nM. Assay description: The inhibitor potency of the exemplified compounds was measured in an enzyme assay that measures peptide phosphorylation using FRET measurements to d...
Ligand InfoPC cidPC sid
In DepthDetails US Patent
TargetFibroblast growth factor receptor 3(Homo sapiens (Human))
Incyte
US Patent
LigandPNGBDBM262050(US10251892, Example 168 | US10632126, Example 168 ...)
Affinity DataIC50: <10nM. Assay description: FGFR1, FGFR2, and FGFR4 are measured under equivalent conditions with the following changes in enzyme and ATP concentrations: FGFR1, 0.02 nM and 210 ...
Ligand InfoPC cidPC sid
In DepthDetails US Patent
TargetFibroblast growth factor receptor 4(Homo sapiens (Human))
Incyte
US Patent
LigandPNGBDBM262050(US10251892, Example 168 | US10632126, Example 168 ...)
Affinity DataIC50:  20nM. Assay description: FGFR1, FGFR2, and FGFR4 are measured under equivalent conditions with the following changes in enzyme and ATP concentrations: FGFR1, 0.02 nM and 210 ...
Ligand InfoPC cidPC sid
In DepthDetails US Patent
TargetFibroblast growth factor receptor 1(Homo sapiens (Human))
Incyte
US Patent
LigandPNGBDBM262050(US10251892, Example 168 | US10632126, Example 168 ...)
Affinity DataIC50:  20nM. Assay description: FGFR1, FGFR2, and FGFR4 are measured under equivalent conditions with the following changes in enzyme and ATP concentrations: FGFR1, 0.02 nM and 210 ...
Ligand InfoPC cidPC sid
In DepthDetails US Patent
TargetFibroblast growth factor receptor 2(Homo sapiens (Human))
Incyte
US Patent
LigandPNGBDBM262050(US10251892, Example 168 | US10632126, Example 168 ...)
Affinity DataIC50: <10nM. Assay description: FGFR1, FGFR2, and FGFR4 are measured under equivalent conditions with the following changes in enzyme and ATP concentrations: FGFR1, 0.02 nM and 210 ...
Ligand InfoPC cidPC sid
In DepthDetails US Patent
TargetFibroblast growth factor receptor 3(Homo sapiens (Human))
Incyte
US Patent
LigandPNGBDBM262050(US10251892, Example 168 | US10632126, Example 168 ...)
Affinity DataIC50: <10nM. Assay description: FGFR1, FGFR2, and FGFR4 are measured under equivalent conditions with the following changes in enzyme and ATP concentrations: FGFR1, 0.02 nM and 210 ...
Ligand InfoPC cidPC sid
In DepthDetails US Patent
TargetFibroblast growth factor receptor 4(Homo sapiens (Human))
Incyte
US Patent
LigandPNGBDBM262050(US10251892, Example 168 | US10632126, Example 168 ...)
Affinity DataIC50:  20nM. Assay description: FGFR1, FGFR2, and FGFR4 are measured under equivalent conditions with the following changes in enzyme and ATP concentrations: FGFR1, 0.02 nM and 210 ...
Ligand InfoPC cidPC sid
In DepthDetails US Patent
TargetFibroblast growth factor receptor 1(Homo sapiens (Human))
Incyte
US Patent
LigandPNGBDBM262050(US10251892, Example 168 | US10632126, Example 168 ...)
Affinity DataIC50:  20nM. Assay description: The inhibitor potency of the exemplified compounds was measured in an enzyme assay that measures peptide phosphorylation using FRET measurements to d...
Ligand InfoPC cidPC sid
In DepthDetails US Patent
TargetFibroblast growth factor receptor 2(Homo sapiens (Human))
Incyte
US Patent
LigandPNGBDBM262050(US10251892, Example 168 | US10632126, Example 168 ...)
Affinity DataIC50: <10nM. Assay description: The inhibitor potency of the exemplified compounds was measured in an enzyme assay that measures peptide phosphorylation using FRET measurements to d...
Ligand InfoPC cidPC sid
In DepthDetails US Patent
TargetFibroblast growth factor receptor 3(Homo sapiens (Human))
Incyte
US Patent
LigandPNGBDBM262050(US10251892, Example 168 | US10632126, Example 168 ...)
Affinity DataIC50: <10nM. Assay description: The inhibitor potency of the exemplified compounds was measured in an enzyme assay that measures peptide phosphorylation using FRET measurements to d...
Ligand InfoPC cidPC sid
In DepthDetails US Patent
TargetFibroblast growth factor receptor 4(Homo sapiens (Human))
Incyte
US Patent
LigandPNGBDBM262050(US10251892, Example 168 | US10632126, Example 168 ...)
Affinity DataIC50:  20nM. Assay description: The inhibitor potency of the exemplified compounds was measured in an enzyme assay that measures peptide phosphorylation using FRET measurements to d...
Ligand InfoPC cidPC sid
In DepthDetails US Patent
TargetFibroblast growth factor receptor 1(Homo sapiens (Human))
Incyte
US Patent
LigandPNGBDBM262050(US10251892, Example 168 | US10632126, Example 168 ...)
Affinity DataIC50:  20nM. Assay description: In the FGFR Enzymatic Assay after dilution in assay buffer, added to the plate and pre-incubated for 5 to 10 minutes.
Ligand InfoPC cidPC sid
In DepthDetails US Patent
TargetFibroblast growth factor receptor 2(Homo sapiens (Human))
Incyte
US Patent
LigandPNGBDBM262050(US10251892, Example 168 | US10632126, Example 168 ...)
Affinity DataIC50: <10nM. Assay description: In the FGFR Enzymatic Assay after dilution in assay buffer, added to the plate and pre-incubated for 5 to 10 minutes.
Ligand InfoPC cidPC sid
In DepthDetails US Patent
TargetFibroblast growth factor receptor 3(Homo sapiens (Human))
Incyte
US Patent
LigandPNGBDBM262050(US10251892, Example 168 | US10632126, Example 168 ...)
Affinity DataIC50: <10nM. Assay description: In the FGFR Enzymatic Assay after dilution in assay buffer, added to the plate and pre-incubated for 5 to 10 minutes.
Ligand InfoPC cidPC sid
In DepthDetails US Patent
TargetFibroblast growth factor receptor 4(Homo sapiens (Human))
Incyte
US Patent
LigandPNGBDBM262050(US10251892, Example 168 | US10632126, Example 168 ...)
Affinity DataIC50:  20nM. Assay description: In the FGFR Enzymatic Assay after dilution in assay buffer, added to the plate and pre-incubated for 5 to 10 minutes.
Ligand InfoPC cidPC sid
In DepthDetails US Patent
TargetFibroblast growth factor receptor 1(Homo sapiens (Human))
Incyte
US Patent
LigandPNGBDBM262050(US10251892, Example 168 | US10632126, Example 168 ...)
Affinity DataIC50:  20nM. Assay description: The inhibitor potency of the exemplified compounds was measured in an enzyme assay that measures peptide phosphorylation using FRET measurements to d...
Ligand InfoPC cidPC sid
In DepthDetails US Patent
TargetFibroblast growth factor receptor 2(Homo sapiens (Human))
Incyte
US Patent
LigandPNGBDBM262050(US10251892, Example 168 | US10632126, Example 168 ...)
Affinity DataIC50: <10nM. Assay description: The inhibitor potency of the exemplified compounds was measured in an enzyme assay that measures peptide phosphorylation using FRET measurements to d...
Ligand InfoPC cidPC sid
In DepthDetails US Patent
TargetFibroblast growth factor receptor 3(Homo sapiens (Human))
Incyte
US Patent
LigandPNGBDBM262050(US10251892, Example 168 | US10632126, Example 168 ...)
Affinity DataIC50: <10nM. Assay description: The inhibitor potency of the exemplified compounds was measured in an enzyme assay that measures peptide phosphorylation using FRET measurements to d...
Ligand InfoPC cidPC sid
In DepthDetails US Patent
TargetFibroblast growth factor receptor 4(Homo sapiens (Human))
Incyte
US Patent
LigandPNGBDBM262050(US10251892, Example 168 | US10632126, Example 168 ...)
Affinity DataIC50:  20nM. Assay description: The inhibitor potency of the exemplified compounds was measured in an enzyme assay that measures peptide phosphorylation using FRET measurements to d...
Ligand InfoPC cidPC sid
In DepthDetails US Patent
TargetFibroblast growth factor receptor 1(Homo sapiens (Human))
Incyte
US Patent
LigandPNGBDBM262050(US10251892, Example 168 | US10632126, Example 168 ...)
Affinity DataIC50:  20nM. Assay description: The inhibitor potency of the exemplified compounds was measured in an enzyme assay that measures peptide phosphorylation using FRET measurements to d...
Ligand InfoPC cidPC sid
In DepthDetails US Patent
TargetFibroblast growth factor receptor 2(Homo sapiens (Human))
Incyte
US Patent
LigandPNGBDBM262050(US10251892, Example 168 | US10632126, Example 168 ...)
Affinity DataIC50: <10nM. Assay description: The inhibitor potency of the exemplified compounds was measured in an enzyme assay that measures peptide phosphorylation using FRET measurements to d...
Ligand InfoPC cidPC sid
In DepthDetails US Patent
TargetFibroblast growth factor receptor 3(Homo sapiens (Human))
Incyte
US Patent
LigandPNGBDBM262050(US10251892, Example 168 | US10632126, Example 168 ...)
Affinity DataIC50: <10nM. Assay description: The inhibitor potency of the exemplified compounds was measured in an enzyme assay that measures peptide phosphorylation using FRET measurements to d...
Ligand InfoPC cidPC sid
In DepthDetails US Patent
TargetFibroblast growth factor receptor 4(Homo sapiens (Human))
Incyte
US Patent
LigandPNGBDBM262050(US10251892, Example 168 | US10632126, Example 168 ...)
Affinity DataIC50:  20nM. Assay description: The inhibitor potency of the exemplified compounds was measured in an enzyme assay that measures peptide phosphorylation using FRET measurements to d...
Ligand InfoPC cidPC sid
In DepthDetails US Patent
TargetFibroblast growth factor receptor 1(Homo sapiens (Human))
Incyte
US Patent
LigandPNGBDBM262050(US10251892, Example 168 | US10632126, Example 168 ...)
Affinity DataIC50:  20nM. Assay description: The inhibitor potency of the exemplified compounds was measured in an enzyme assay that measures peptide phosphorylation using FRET measurements to d...
Ligand InfoPC cidPC sid
In DepthDetails US Patent
TargetFibroblast growth factor receptor 2(Homo sapiens (Human))
Incyte
US Patent
LigandPNGBDBM262050(US10251892, Example 168 | US10632126, Example 168 ...)
Affinity DataIC50: <10nM. Assay description: The inhibitor potency of the exemplified compounds was measured in an enzyme assay that measures peptide phosphorylation using FRET measurements to d...
Ligand InfoPC cidPC sid
In DepthDetails US Patent
TargetFibroblast growth factor receptor 3(Homo sapiens (Human))
Incyte
US Patent
LigandPNGBDBM262050(US10251892, Example 168 | US10632126, Example 168 ...)
Affinity DataIC50: <10nM. Assay description: The inhibitor potency of the exemplified compounds was measured in an enzyme assay that measures peptide phosphorylation using FRET measurements to d...
Ligand InfoPC cidPC sid
In DepthDetails US Patent
TargetFibroblast growth factor receptor 2(Homo sapiens (Human))
Incyte
US Patent
LigandPNGBDBM262050(US10251892, Example 168 | US10632126, Example 168 ...)
Affinity DataIC50: <10nM. Assay description: FGFR1, FGFR2, and FGFR4 are measured under equivalent conditions with the following changes in enzyme and ATP concentrations: FGFR1, 0.02 nM and 210 ...
Ligand InfoPC cidPC sid
In DepthDetails US Patent